{"text_format":"1","workbook":"xlsx","n_sheets":3,"sheets":["Grafici","Statistiche","Dati"],"not_rendered":{"charts":92,"images":0,"macros":1,"external_links":0,"defined_names":264,"comments":0,"pivot_tables":0},"unopened":[],"bounds":{"document_bytes":16777216,"sheet_cells":100000,"rows_first":2000,"rows_last":500,"rows_between":2000,"halvings":0,"cell_chars":16384,"cell_head_chars":4096},"cells_cut":0,"cells_raw":0,"read":"whole","date_system":"1900"}

{"sheet":"Grafici","index":0,"n_rows":0,"n_cols":0,"rows_kept":0,"cut":false,"hidden":false,"merged":[]}

{"sheet":"Statistiche","index":1,"n_rows":1350,"n_cols":28,"rows_kept":1350,"cut":false,"hidden":false,"merged":[]}
["Data","Codice","Regione","Ricoverati","Terap. Intens.","Ospedalizzati","Quarantena","Positivi","+ Positivi","Nuovi","Guariti","Deceduti","Totale","Tamponi",null,null,"x 2",null,"% su Tot.","+ Nuovi","+ Guariti","+ Deceduti","+ Totali","+ Tamponi","% Positivi","% Guariti","% Deceduti","P. Stimati"]
["2020-02-24T18:00:00",1,"Piemonte",2,0,2,1,3,0,3,0,0,3,141,{"$f":"M2","v":3},null,{"$f":"M2","v":3},null,{"$f":"M2*100/M1295","v":1.3100436681222707},null,null,null,null,null,{"$f":"IF(M2=0,0,H2/M2)","v":1},{"$f":"IF(M2=0,0,K2/M2)","v":0},{"$f":"IF(M2=0,0,L2/M2)","v":0},{"$f":"L2*100/B$1285","v":0}]
["2020-02-25T18:00:00",1,"Piemonte",2,0,2,1,3,0,0,0,0,3,141,{"$f":"IF(P3=\"x2\",M3,O2)","v":3},{"$f":"IF(M3>O2*2,\"x2\",O2)","v":3},{"$f":"IF(P3=\"x2\",M3,\"\")","v":""},null,{"$f":"M3*100/M1296","v":0.93167701863354035},{"$f":"IF(J3-J2=0,\"\",J3-J2)","v":-3},{"$f":"IF(K3-K2=0,\"\",K3-K2)","v":""},{"$f":"IF(L3-L2=0,\"\",L3-L2)","v":""},{"$f":"IF(M3-M2=0,\"\",M3-M2)","v":""},{"$f":"IF(N3-N2=0,\"\",N3-N2)","v":""},1,0,0,{"$f":"L3*100/B$1285","v":0}]
["2020-02-26T18:00:00",1,"Piemonte",2,0,2,1,3,0,0,0,0,3,156,3,3,"",null,{"$f":"M4*100/M1297","v":0.75},"","","","",15,1,0,0,{"$f":"L4*100/B$1285","v":0}]
["2020-02-27T18:00:00",1,"Piemonte",2,0,2,0,2,-1,-1,0,0,2,156,3,3,"",null,{"$f":"M5*100/M1298","v":0.30769230769230771},-1,"","",-1,"",1,0,0,{"$f":"L5*100/B$1285","v":0}]
["2020-02-28T18:00:00",1,"Piemonte",7,0,7,4,11,9,9,0,0,11,227,11,"x2",11,null,{"$f":"M6*100/M1299","v":1.2387387387387387},10,"","",9,71,1,0,0,{"$f":"L6*100/B$1285","v":0}]
["2020-02-29T17:00:00",1,"Piemonte",7,0,7,4,11,0,0,0,0,11,308,11,11,"",null,{"$f":"M7*100/M1300","v":0.97517730496453903},-9,"","","",81,1,0,0,{"$f":"L7*100/B$1285","v":0}]
["2020-03-01T17:00:00",1,"Piemonte",11,2,13,36,49,38,38,0,0,49,362,49,"x2",49,null,{"$f":"M8*100/M1301","v":2.8925619834710745},38,"","",38,54,1,0,0,{"$f":"L8*100/B$1285","v":0}]
["2020-03-02T18:00:00",1,"Piemonte",12,2,14,37,51,2,2,0,0,51,434,49,49,"",null,{"$f":"M9*100/M1302","v":2.504911591355599},-36,"","",2,72,1,0,0,{"$f":"L9*100/B$1285","v":0}]
["2020-03-03T18:00:00",1,"Piemonte",13,3,16,40,56,5,5,0,0,56,458,49,49,"",null,{"$f":"M10*100/M1303","v":2.2382094324540369},3,"","",5,24,1,0,0,{"$f":"L10*100/B$1285","v":0}]
["2020-03-04T17:00:00",1,"Piemonte",26,13,39,43,82,26,26,0,0,82,543,49,49,"",null,{"$f":"M11*100/M1304","v":2.6545807704758824},21,"","",26,85,1,0,0,{"$f":"L11*100/B$1285","v":0}]
["2020-03-05T17:00:00",1,"Piemonte",43,17,60,46,106,24,24,0,2,108,543,108,"x2",108,null,{"$f":"M12*100/M1305","v":2.7993779160186625},-2,"",2,26,"",0.98148148148148151,0,1.8518518518518517E-2,{"$f":"L12*100/B$1285","v":70.671378091872796}]
["2020-03-06T17:00:00",1,"Piemonte",57,30,87,52,139,33,33,0,4,143,793,108,108,"",null,{"$f":"M13*100/M1306","v":3.0845556514236412},9,"",2,35,250,0.97202797202797198,0,2.7972027972027972E-2,{"$f":"L13*100/B$1285","v":141.34275618374559}]
["2020-03-07T18:00:00",1,"Piemonte",110,38,148,54,202,63,63,0,5,207,1046,108,108,"",null,{"$f":"M14*100/M1307","v":3.5186129525752166},30,"",1,64,253,0.97584541062801933,0,2.4154589371980676E-2,{"$f":"L14*100/B$1285","v":176.67844522968198}]
["2020-03-08T18:00:00",1,"Piemonte",245,45,290,65,355,153,153,0,5,360,1636,360,"x2",360,null,{"$f":"M15*100/M1308","v":4.8813559322033901},90,"","",153,590,0.98611111111111116,0,1.3888888888888888E-2,{"$f":"L15*100/B$1285","v":176.67844522968198}]
["2020-03-09T18:00:00",1,"Piemonte",222,50,272,65,337,-18,-18,0,13,350,1681,360,360,"",null,{"$f":"M16*100/M1309","v":3.8159616223288269},-171,"",8,-10,45,0.96285714285714286,0,3.7142857142857144E-2,{"$f":"L16*100/B$1285","v":459.36395759717311}]
["2020-03-10T18:00:00",1,"Piemonte",306,66,372,64,436,99,99,0,17,453,2374,360,360,"",null,{"$f":"M17*100/M1310","v":4.463493940289684},117,"",4,103,693,0.96247240618101548,0,3.7527593818984545E-2,{"$f":"L17*100/B$1285","v":600.70671378091868}]
["2020-03-11T17:00:00",1,"Piemonte",319,75,394,86,480,44,44,0,21,501,2431,360,360,"",null,{"$f":"M18*100/M1311","v":4.0202214732787676},-55,"",4,48,57,0.95808383233532934,0,4.1916167664670656E-2,{"$f":"L18*100/B$1285","v":742.04946996466424}]
["2020-03-12T17:00:00",1,"Piemonte",368,97,465,89,554,74,74,0,26,580,2879,360,360,"",null,{"$f":"M19*100/M1312","v":3.8377555746708132},30,"",5,79,448,0.95517241379310347,0,4.4827586206896551E-2,{"$f":"L19*100/B$1285","v":918.72791519434622}]
["2020-03-13T17:00:00",1,"Piemonte",556,135,691,103,794,240,240,0,46,840,3105,840,"x2",840,null,{"$f":"M20*100/M1313","v":4.756511891279728},166,"",20,260,226,0.94523809523809521,0,5.4761904761904762E-2,{"$f":"L20*100/B$1285","v":1625.4416961130742}]
["2020-03-14T17:00:00",1,"Piemonte",538,150,688,126,814,20,20,0,59,873,3680,840,840,"",null,{"$f":"M21*100/M1314","v":4.1262938980006618},-220,"",13,33,575,0.93241695303550975,0,6.7583046964490259E-2,{"$f":"L21*100/B$1285","v":2084.8056537102475}]
["2020-03-15T17:00:00",1,"Piemonte",726,171,897,133,1030,216,216,0,81,1111,4375,840,840,"",null,{"$f":"M22*100/M1315","v":4.489433062593446},196,"",22,238,695,0.92709270927092713,0,7.2907290729072913E-2,{"$f":"L22*100/B$1285","v":2862.190812720848}]
["2020-03-16T17:00:00",1,"Piemonte",1045,186,1231,174,1405,375,375,0,111,1516,5588,840,840,"",null,{"$f":"M23*100/M1316","v":5.4181558255897073},159,"",30,405,1213,0.92678100263852248,0,7.3218997361477578E-2,{"$f":"L23*100/B$1285","v":3922.2614840989399}]
["2020-03-17T17:00:00",1,"Piemonte",1378,206,1584,180,1764,359,359,0,133,1897,6543,1897,"x2",1897,null,{"$f":"M24*100/M1317","v":6.0210753507268455},-16,"",22,381,955,0.92988929889298888,0,7.0110701107011064E-2,{"$f":"L24*100/B$1285","v":4699.6466431095405}]
["2020-03-18T17:00:00",1,"Piemonte",1780,227,2007,180,2187,423,423,0,154,2341,7516,1897,1897,"",null,{"$f":"M25*100/M1318","v":6.5550359812953269},64,"",21,444,973,0.93421614694574973,0,6.5783853054250316E-2,{"$f":"L25*100/B$1285","v":5441.6961130742047}]
["2020-03-19T17:00:00",1,"Piemonte",2279,257,2536,218,2754,567,567,3,175,2932,8853,1897,1897,"",null,{"$f":"M26*100/M1319","v":7.1451200194955522},144,3,21,591,1337,0.93929058663028653,1.0231923601637107E-3,5.9686221009549796E-2,{"$f":"L26*100/B$1285","v":6183.745583038869}]
["2020-03-20T17:00:00",1,"Piemonte",1541,280,1821,1423,3244,490,490,8,209,3461,9975,1897,1897,"",null,{"$f":"M27*100/M1320","v":7.3605410348567659},-77,5,34,529,{"$f":"IF(N27-N26=0,\"\",N27-N26)","v":1122},0.93730135798902048,2.3114706732158337E-3,6.0387171337763654E-2,{"$f":"L27*100/B$1285","v":7385.1590106007061}]
["2020-03-21T17:00:00",1,"Piemonte",1976,301,2277,1229,3506,262,262,8,238,3752,10701,1897,1897,"",null,{"$f":"M28*100/M1321","v":7.0028743140841394},-228,"",29,{"$f":"IF(M28-M27=0,\"\",M28-M27)","v":291},726,0.93443496801705761,2.1321961620469083E-3,6.3432835820895525E-2,{"$f":"L28*100/B$1285","v":8409.8939929328626}]
["2020-03-22T17:00:00",1,"Piemonte",2118,308,2426,1701,4127,621,621,10,283,4420,12701,4420,"x2",4420,null,{"$f":"M29*100/M1322","v":7.4740437620480913},359,2,45,668,2000,0.93371040723981902,2.2624434389140274E-3,6.4027149321266963E-2,{"$f":"L29*100/B$1285","v":10000}]
["2020-03-23T17:00:00",1,"Piemonte",2194,343,2537,1992,4529,402,402,17,315,4861,13560,4420,4420,"",null,{"$f":"M30*100/M1323","v":7.603985796298903},-219,7,32,441,859,0.93170129602962348,3.497222793663855E-3,6.4801481176712611E-2,{"$f":"L30*100/B$1285","v":11130.742049469964}]
["2020-03-24T17:00:00",1,"Piemonte",2404,360,2764,2360,5124,595,595,17,374,5515,15469,4420,4420,"",null,{"$f":"M31*100/M1324","v":7.9724181797155085},193,"",59,654,1909,0.92910244786944696,3.0825022665457841E-3,6.7815049864007257E-2,{"$f":"L31*100/B$1285","v":13215.547703180211}]
["2020-03-25T17:00:00",1,"Piemonte",2544,381,2925,2631,5556,432,432,19,449,6024,16655,4420,4420,"",null,{"$f":"M32*100/M1325","v":8.0982980668405347},-163,2,75,509,1186,0.92231075697211151,3.1540504648074367E-3,7.4535192563081012E-2,{"$f":"L32*100/B$1285","v":15865.724381625441}]
["2020-03-26T17:00:00",1,"Piemonte",2633,408,3041,2909,5950,394,394,135,449,6534,18054,4420,4420,"",null,{"$f":"M33*100/M1326","v":8.1128397422366803},-38,116,"",510,{"$f":"IF(N33-N32=0,\"\",N33-N32)","v":1399},0.91062136516681969,2.0661157024793389E-2,6.8717477808386898E-2,{"$f":"L33*100/B$1285","v":15865.724381625441}]
["2020-03-27T17:00:00",1,"Piemonte",2852,431,3283,3064,6347,397,558,176,569,7092,19705,4420,{"$f":"IF(M34>O33*2,\"x2\",O33)","v":4420},{"$f":"IF(P34=\"x2\",M34,\"\")","v":""},null,{"$f":"M34*100/M1327","v":8.1990335036648254},{"$f":"IF(J34-J33=0,\"\",J34-J33)","v":164},41,120,558,1651,0.89495205865764238,2.4816694867456288E-2,8.0231246474901291E-2,{"$f":"L34*100/B$1285","v":20106.007067137809}]
["2020-03-28T17:00:00",1,"Piemonte",3094,439,3533,3318,6851,504,579,203,617,7671,21511,{"$f":"IF(P35=\"x2\",M35,O34)","v":4420},4420,"",null,{"$f":"M35*100/M1328","v":8.2954840384116277},21,27,48,579,1806,0.89310389779689736,2.6463303350280278E-2,8.0432798852822313E-2,{"$f":"L35*100/B$1285","v":21802.120141342755}]
["2020-03-29T17:00:00",1,"Piemonte",2985,443,3428,3840,7268,417,535,254,684,8206,24058,4420,4420,"",null,{"$f":"M36*100/M1329","v":8.4001269334316042},-44,51,67,535,2547,0.88569339507677314,3.0952961247867415E-2,8.3353643675359496E-2,{"$f":"L36*100/B$1285","v":24169.611307420495}]
["2020-03-30T17:00:00",1,"Piemonte",2985,452,3437,4218,7655,387,506,308,749,8712,25478,4420,4420,"",null,{"$f":"M37*100/M1330","v":8.563087901394745},-29,54,65,506,1420,0.87867309458218545,3.5353535353535352E-2,8.5973370064279159E-2,{"$f":"L37*100/B$1285","v":26466.431095406359}]
["2020-03-31T17:00:00",1,"Piemonte",3174,452,3626,4456,8082,427,589,365,854,9301,27658,9301,"x2",9301,null,{"$f":"M38*100/M1331","v":8.7917800967937083},83,57,105,589,2180,0.86893882378238896,3.9243092140630043E-2,9.1818084076980971E-2,{"$f":"L38*100/B$1285","v":30176.678445229682}]
["2020-04-01T17:00:00",1,"Piemonte",3146,453,3599,4871,8470,388,494,439,886,9795,30060,9301,9301,"",null,{"$f":"M39*100/M1332","v":8.8583211243149389},-95,74,32,494,{"$f":"IF(N39-N38=0,\"\",N39-N38)","v":2402},{"$f":"IF(M39=0,0,H39/M39)","v":0.86472690148034714},{"$f":"IF(M39=0,0,K39/M39)","v":4.4818785094435938E-2},{"$f":"IF(M39=0,0,L39/M39)","v":9.0454313425216953E-2},{"$f":"L39*100/B$1285","v":31307.420494699647}]
["2020-04-02T17:00:00",1,"Piemonte",3341,453,3794,5005,8799,329,558,571,983,10353,32100,9301,{"$f":"IF(M40>O39*2,\"x2\",O39)","v":9301},{"$f":"IF(P40=\"x2\",M40,\"\")","v":""},null,{"$f":"M40*100/M1333","v":8.9837038579684485},{"$f":"IF(J40-J39=0,\"\",J40-J39)","v":64},{"$f":"IF(K40-K39=0,\"\",K40-K39)","v":132},{"$f":"IF(L40-L39=0,\"\",L40-L39)","v":97},{"$f":"IF(M40-M39=0,\"\",M40-M39)","v":558},2040,0.84989858012170383,5.5153095721047041E-2,9.4948324157249103E-2,{"$f":"L40*100/B$1285","v":34734.98233215548}]
["2020-04-03T17:00:00",1,"Piemonte",3300,452,3752,5378,9130,331,543,723,1043,10896,34281,{"$f":"IF(P41=\"x2\",M41,O40)","v":9301},{"$f":"IF(M41>O40*2,\"x2\",O40)","v":9301},{"$f":"IF(P41=\"x2\",M41,\"\")","v":""},null,{"$f":"M41*100/M1334","v":9.0931092324768201},{"$f":"IF(J41-J40=0,\"\",J41-J40)","v":-15},{"$f":"IF(K41-K40=0,\"\",K41-K40)","v":152},{"$f":"IF(L41-L40=0,\"\",L41-L40)","v":60},{"$f":"IF(M41-M40=0,\"\",M41-M40)","v":543},2181,0.83792217327459617,6.6354625550660795E-2,9.5723201174743019E-2,{"$f":"L41*100/B$1285","v":36855.123674911658}]
["2020-04-04T17:00:00",1,"Piemonte",3441,450,3891,5802,9693,563,813,888,1128,11709,37181,{"$f":"IF(P42=\"x2\",M42,O41)","v":9301},{"$f":"IF(M42>O41*2,\"x2\",O41)","v":9301},{"$f":"IF(P42=\"x2\",M42,\"\")","v":""},null,{"$f":"M42*100/M1335","v":9.3948584633160017},{"$f":"IF(J42-J41=0,\"\",J42-J41)","v":270},{"$f":"IF(K42-K41=0,\"\",K42-K41)","v":165},{"$f":"IF(L42-L41=0,\"\",L42-L41)","v":85},{"$f":"IF(M42-M41=0,\"\",M42-M41)","v":813},2900,0.82782475019215984,7.5839098129643859E-2,9.6336151678196258E-2,{"$f":"L42*100/B$1285","v":39858.657243816255}]
["2020-04-05T17:00:00",1,"Piemonte",3472,444,3916,6261,10177,484,653,1017,1168,12362,38539,{"$f":"IF(P43=\"x2\",M43,O42)","v":9301},{"$f":"IF(M43>O42*2,\"x2\",O42)","v":9301},{"$f":"IF(P43=\"x2\",M43,\"\")","v":""},null,{"$f":"M43*100/M1336","v":9.5868101870521443},{"$f":"IF(J43-J42=0,\"\",J43-J42)","v":-160},{"$f":"IF(K43-K42=0,\"\",K43-K42)","v":129},{"$f":"IF(L43-L42=0,\"\",L43-L42)","v":40},{"$f":"IF(M43-M42=0,\"\",M43-M42)","v":653},1358,0.82324866526452034,8.2268241384889182E-2,9.4483093350590519E-2,{"$f":"L43*100/B$1285","v":41272.084805653707}]
["2020-04-06T17:00:00",1,"Piemonte",3484,438,3922,6623,10545,368,562,1128,1251,12924,41123,{"$f":"IF(P44=\"x2\",M44,O43)","v":9301},{"$f":"IF(M44>O43*2,\"x2\",O43)","v":9301},{"$f":"IF(P44=\"x2\",M44,\"\")","v":""},null,{"$f":"M44*100/M1337","v":9.7505035949512244},{"$f":"IF(J44-J43=0,\"\",J44-J43)","v":-91},{"$f":"IF(K44-K43=0,\"\",K44-K43)","v":111},{"$f":"IF(L44-L43=0,\"\",L44-L43)","v":83},{"$f":"IF(M44-M43=0,\"\",M44-M43)","v":562},2584,0.81592386258124416,8.72794800371402E-2,9.6796657381615595E-2,{"$f":"L44*100/B$1285","v":44204.946996466431}]
["2020-04-07T17:00:00",1,"Piemonte",3553,432,3985,6719,10704,159,419,1320,1319,13343,44121,{"$f":"IF(P45=\"x2\",M45,O44)","v":9301},{"$f":"IF(M45>O44*2,\"x2\",O44)","v":9301},{"$f":"IF(P45=\"x2\",M45,\"\")","v":""},null,{"$f":"M45*100/M1338","v":9.8409865325328578},{"$f":"IF(J45-J44=0,\"\",J45-J44)","v":-143},{"$f":"IF(K45-K44=0,\"\",K45-K44)","v":192},{"$f":"IF(L45-L44=0,\"\",L45-L44)","v":68},{"$f":"IF(M45-M44=0,\"\",M45-M44)","v":419},{"$f":"IF(N45-N44=0,\"\",N45-N44)","v":2998},{"$f":"IF(M45=0,0,H45/M45)","v":0.80221839166604214},{"$f":"IF(M45=0,0,K45/M45)","v":9.8928276999175599E-2},{"$f":"IF(M45=0,0,L45/M45)","v":9.8853331334782288E-2},{"$f":"L45*100/B$1285","v":46607.773851590107}]
["2020-04-08T17:00:00",1,"Piemonte",3493,423,3916,7073,10989,285,540,1516,1378,13883,48495,{"$f":"IF(P46=\"x2\",M46,O45)","v":9301},{"$f":"IF(M46>O45*2,\"x2\",O45)","v":9301},{"$f":"IF(P46=\"x2\",M46,\"\")","v":""},null,{"$f":"M46*100/M1339","v":9.9575389823700711},{"$f":"IF(J46-J45=0,\"\",J46-J45)","v":121},{"$f":"IF(K46-K45=0,\"\",K46-K45)","v":196},{"$f":"IF(L46-L45=0,\"\",L46-L45)","v":59},{"$f":"IF(M46-M45=0,\"\",M46-M45)","v":540},{"$f":"IF(N46-N45=0,\"\",N46-N45)","v":4374},{"$f":"IF(M46=0,0,H46/M46)","v":0.79154361449254484},{"$f":"IF(M46=0,0,K46/M46)","v":0.10919830007923359},{"$f":"IF(M46=0,0,L46/M46)","v":9.9258085428221565E-2},{"$f":"L46*100/B$1285","v":48692.579505300353}]
["2020-04-09T17:00:00",1,"Piemonte",3514,412,3926,7410,11336,347,639,1732,1454,14522,52807,{"$f":"IF(P47=\"x2\",M47,O46)","v":9301},{"$f":"IF(M47>O46*2,\"x2\",O46)","v":9301},{"$f":"IF(P47=\"x2\",M47,\"\")","v":""},null,{"$f":"M47*100/M1340","v":10.110982691156197},{"$f":"IF(J47-J46=0,\"\",J47-J46)","v":99},{"$f":"IF(K47-K46=0,\"\",K47-K46)","v":216},{"$f":"IF(L47-L46=0,\"\",L47-L46)","v":76},{"$f":"IF(M47-M46=0,\"\",M47-M46)","v":639},{"$f":"IF(N47-N46=0,\"\",N47-N46)","v":4312},{"$f":"IF(M47=0,0,H47/M47)","v":0.78060873157967225},{"$f":"IF(M47=0,0,K47/M47)","v":0.11926731855116375},{"$f":"IF(M47=0,0,L47/M47)","v":0.10012394986916402},{"$f":"L47*100/B$1285","v":51378.09187279152}]
["2020-04-10T17:00:00",1,"Piemonte",3497,394,3891,7685,11576,240,490,1904,1532,15012,57457,{"$f":"IF(P48=\"x2\",M48,O47)","v":9301},{"$f":"IF(M48>O47*2,\"x2\",O47)","v":9301},{"$f":"IF(P48=\"x2\",M48,\"\")","v":""},null,{"$f":"M48*100/M1341","v":10.172316824437413},{"$f":"IF(J48-J47=0,\"\",J48-J47)","v":-149},{"$f":"IF(K48-K47=0,\"\",K48-K47)","v":172},{"$f":"IF(L48-L47=0,\"\",L48-L47)","v":78},{"$f":"IF(M48-M47=0,\"\",M48-M47)","v":490},{"$f":"IF(N48-N47=0,\"\",N48-N47)","v":4650},{"$f":"IF(M48=0,0,H48/M48)","v":0.77111644018118841},{"$f":"IF(M48=0,0,K48/M48)","v":0.12683186783906208},{"$f":"IF(M48=0,0,L48/M48)","v":0.10205169197974953},{"$f":"L48*100/B$1285","v":54134.275618374559}]
["2020-04-11T17:00:00",1,"Piemonte",3435,384,3819,8351,12170,594,996,2205,1633,16008,62577,{"$f":"IF(P49=\"x2\",M49,O48)","v":9301},{"$f":"IF(M49>O48*2,\"x2\",O48)","v":9301},{"$f":"IF(P49=\"x2\",M49,\"\")","v":""},null,{"$f":"M49*100/M1342","v":10.512835667986682},{"$f":"IF(J49-J48=0,\"\",J49-J48)","v":506},{"$f":"IF(K49-K48=0,\"\",K49-K48)","v":301},{"$f":"IF(L49-L48=0,\"\",L49-L48)","v":101},{"$f":"IF(M49-M48=0,\"\",M49-M48)","v":996},{"$f":"IF(N49-N48=0,\"\",N49-N48)","v":5120},{"$f":"IF(M49=0,0,H49/M49)","v":0.76024487756121939},{"$f":"IF(M49=0,0,K49/M49)","v":0.13774362818590705},{"$f":"IF(M49=0,0,L49/M49)","v":0.10201149425287356},{"$f":"L49*100/B$1285","v":57703.180212014129}]
["2020-04-12T17:00:00",1,"Piemonte",3429,381,3810,8695,12505,335,652,2426,1729,16660,66555,{"$f":"IF(P50=\"x2\",M50,O49)","v":9301},{"$f":"IF(M50>O49*2,\"x2\",O49)","v":9301},{"$f":"IF(P50=\"x2\",M50,\"\")","v":""},null,{"$f":"M50*100/M1343","v":10.654694524919579},{"$f":"IF(J50-J49=0,\"\",J50-J49)","v":-344},{"$f":"IF(K50-K49=0,\"\",K50-K49)","v":221},{"$f":"IF(L50-L49=0,\"\",L50-L49)","v":96},{"$f":"IF(M50-M49=0,\"\",M50-M49)","v":652},{"$f":"IF(N50-N49=0,\"\",N50-N49)","v":3978},{"$f":"IF(M50=0,0,H50/M50)","v":0.75060024009603843},{"$f":"IF(M50=0,0,K50/M50)","v":0.14561824729891956},{"$f":"IF(M50=0,0,L50/M50)","v":0.10378151260504202},{"$f":"L50*100/B$1285","v":61095.406360424029}]
["2020-04-13T17:00:00",1,"Piemonte",3344,379,3723,9042,12765,260,474,2543,1826,17134,69170,{"$f":"IF(P51=\"x2\",M51,O50)","v":9301},{"$f":"IF(M51>O50*2,\"x2\",O50)","v":9301},{"$f":"IF(P51=\"x2\",M51,\"\")","v":""},null,{"$f":"M51*100/M1344","v":10.741242257829935},{"$f":"IF(J51-J50=0,\"\",J51-J50)","v":-178},{"$f":"IF(K51-K50=0,\"\",K51-K50)","v":117},{"$f":"IF(L51-L50=0,\"\",L51-L50)","v":97},{"$f":"IF(M51-M50=0,\"\",M51-M50)","v":474},{"$f":"IF(N51-N50=0,\"\",N51-N50)","v":2615},{"$f":"IF(M51=0,0,H51/M51)","v":0.74500992179292636},{"$f":"IF(M51=0,0,K51/M51)","v":0.14841834948056495},{"$f":"IF(M51=0,0,L51/M51)","v":0.10657172872650869},{"$f":"L51*100/B$1285","v":64522.968197879854}]
["2020-04-14T17:00:00",1,"Piemonte",3395,367,3762,9293,13055,290,556,2708,1927,17690,71678,{"$f":"IF(P52=\"x2\",M52,O51)","v":9301},{"$f":"IF(M52>O51*2,\"x2\",O51)","v":9301},{"$f":"IF(P52=\"x2\",M52,\"\")","v":""},null,{"$f":"M52*100/M1345","v":10.886957806114912},{"$f":"IF(J52-J51=0,\"\",J52-J51)","v":82},{"$f":"IF(K52-K51=0,\"\",K52-K51)","v":165},{"$f":"IF(L52-L51=0,\"\",L52-L51)","v":101},{"$f":"IF(M52-M51=0,\"\",M52-M51)","v":556},{"$f":"IF(N52-N51=0,\"\",N52-N51)","v":2508},{"$f":"IF(M52=0,0,H52/M52)","v":0.73798756359525153},{"$f":"IF(M52=0,0,K52/M52)","v":0.15308083663086489},{"$f":"IF(M52=0,0,L52/M52)","v":0.10893159977388354},{"$f":"L52*100/B$1285","v":68091.872791519432}]
["2020-04-15T17:00:00",1,"Piemonte",3338,366,3704,9491,13195,140,539,3019,2015,18229,75664,{"$f":"IF(P53=\"x2\",M53,O52)","v":9301},{"$f":"IF(M53>O52*2,\"x2\",O52)","v":9301},{"$f":"IF(P53=\"x2\",M53,\"\")","v":""},null,{"$f":"M53*100/M1346","v":11.037510217674306},{"$f":"IF(J53-J52=0,\"\",J53-J52)","v":-17},{"$f":"IF(K53-K52=0,\"\",K53-K52)","v":311},{"$f":"IF(L53-L52=0,\"\",L53-L52)","v":88},{"$f":"IF(M53-M52=0,\"\",M53-M52)","v":539},{"$f":"IF(N53-N52=0,\"\",N53-N52)","v":3986},{"$f":"IF(M53=0,0,H53/M53)","v":0.72384661802622197},{"$f":"IF(M53=0,0,K53/M53)","v":0.16561522848208898},{"$f":"IF(M53=0,0,L53/M53)","v":0.11053815349168906},{"$f":"L53*100/B$1285","v":71201.413427561842}]
[{"$f":"A53 + 1","v":"2020-04-16T17:00:00"},null,null,null,null,null,null,null,null,null,null,null,null,null,null,"Media x2",{"$f":"COUNT(M2:M53) / COUNT(Q2:Q53)","v":5.7777777777777777}]
[{"$f":"A54+1","v":"2020-04-17T17:00:00"}]
[{"$f":"A55+1","v":"2020-04-18T17:00:00"}]
[null,null,null,null,{"$f":"E53/$M53","v":2.0077897855066102E-2},null,null,{"$f":"H53/$M53","v":0.72384661802622197},null,null,{"$f":"K53/$M53","v":0.16561522848208898},{"$f":"L53/$M53","v":0.11053815349168906},null,{"$f":"N53/$M53","v":4.1507488068462344}]
[]
[]
[]
["Data","Codice","Regione","Ricoverati","Terap. Intens.","Ospedalizzati","Quarantena","Positivi","+ Positivi","Nuovi","Guariti","Deceduti","Totale","Tamponi",null,null,"x 2",null,"% su Tot.","+ Nuovi","+ Guariti","+ Deceduti","+ Totali","+ Tamponi","% Positivi","% Guariti","% Deceduti","P. Stimati"]
["2020-02-24T18:00:00",2,"Valle d'Aosta",0,0,0,0,0,0,0,0,0,0,7,{"$f":"M62","v":0},null,{"$f":"M62","v":0},null,{"$f":"M62*100/M1295","v":0},null,null,null,null,null,{"$f":"IF(M62=0,0,H62/M62)","v":0},{"$f":"IF(M62=0,0,K62/M62)","v":0},{"$f":"IF(M62=0,0,L62/M62)","v":0},{"$f":"L62*100/B$1285","v":0}]
["2020-02-25T18:00:00",2,"Valle d'Aosta",0,0,0,0,0,0,0,0,0,0,7,{"$f":"IF(P63=\"x2\",M63,O62)","v":0},{"$f":"IF(M63>O62*2,\"x2\",O62)","v":0},{"$f":"IF(P63=\"x2\",M63,\"\")","v":""},null,{"$f":"M63*100/M1296","v":0},{"$f":"IF(J63-J62=0,\"\",J63-J62)","v":""},{"$f":"IF(K63-K62=0,\"\",K63-K62)","v":""},{"$f":"IF(L63-L62=0,\"\",L63-L62)","v":""},{"$f":"IF(M63-M62=0,\"\",M63-M62)","v":""},{"$f":"IF(N63-N62=0,\"\",N63-N62)","v":""},{"$f":"IF(M63=0,0,H63/M63)","v":0},{"$f":"IF(M63=0,0,K63/M63)","v":0},{"$f":"IF(M63=0,0,L63/M63)","v":0},{"$f":"L63*100/B$1285","v":0}]
["2020-02-26T18:00:00",2,"Valle d'Aosta",0,0,0,0,0,0,0,0,0,0,7,0,0,"",null,{"$f":"M64*100/M1297","v":0},"","","","","",0,0,0,{"$f":"L64*100/B$1285","v":0}]
["2020-02-27T18:00:00",2,"Valle d'Aosta",0,0,0,0,0,0,0,0,0,0,9,0,0,"",null,{"$f":"M65*100/M1298","v":0},"","","","",2,0,0,0,{"$f":"L65*100/B$1285","v":0}]
["2020-02-28T18:00:00",2,"Valle d'Aosta",0,0,0,0,0,0,0,0,0,0,9,0,0,"",null,{"$f":"M66*100/M1299","v":0},"","","","","",0,0,0,{"$f":"L66*100/B$1285","v":0}]
["2020-02-29T17:00:00",2,"Valle d'Aosta",0,0,0,0,0,0,0,0,0,0,9,0,0,"",null,{"$f":"M67*100/M1300","v":0},"","","","","",0,0,0,{"$f":"L67*100/B$1285","v":0}]
["2020-03-01T17:00:00",2,"Valle d'Aosta",0,0,0,0,0,0,0,0,0,0,10,0,0,"",null,{"$f":"M68*100/M1301","v":0},"","","","",1,0,0,0,{"$f":"L68*100/B$1285","v":0}]
["2020-03-02T18:00:00",2,"Valle d'Aosta",0,0,0,0,0,0,0,0,0,0,11,0,0,"",null,{"$f":"M69*100/M1302","v":0},"","","","",1,0,0,0,{"$f":"L69*100/B$1285","v":0}]
["2020-03-03T18:00:00",2,"Valle d'Aosta",0,0,0,0,0,0,0,0,0,0,12,0,0,"",null,{"$f":"M70*100/M1303","v":0},"","","","",1,0,0,0,{"$f":"L70*100/B$1285","v":0}]
["2020-03-04T17:00:00",2,"Valle d'Aosta",0,0,0,0,0,0,0,0,0,0,15,0,0,"",null,{"$f":"M71*100/M1304","v":0},"","","","",3,0,0,0,{"$f":"L71*100/B$1285","v":0}]
["2020-03-05T17:00:00",2,"Valle d'Aosta",0,0,0,2,2,2,2,0,0,2,21,2,"x2",2,null,{"$f":"M72*100/M1305","v":5.1840331778123382E-2},2,"","",2,6,1,0,0,{"$f":"L72*100/B$1285","v":0}]
["2020-03-06T17:00:00",2,"Valle d'Aosta",0,0,0,7,7,5,5,0,0,7,28,7,"x2",7,null,{"$f":"M73*100/M1306","v":0.15099223468507333},3,"","",5,7,1,0,0,{"$f":"L73*100/B$1285","v":0}]
["2020-03-07T18:00:00",2,"Valle d'Aosta",1,0,1,7,8,1,1,0,0,8,32,7,7,"",null,{"$f":"M74*100/M1307","v":0.135985041645419},-4,"","",1,4,1,0,0,{"$f":"L74*100/B$1285","v":0}]
["2020-03-08T18:00:00",2,"Valle d'Aosta",1,0,1,8,9,1,1,0,0,9,41,7,7,"",null,{"$f":"M75*100/M1308","v":0.12203389830508475},"","","",1,9,1,0,0,{"$f":"L75*100/B$1285","v":0}]
["2020-03-09T18:00:00",2,"Valle d'Aosta",4,0,4,11,15,6,6,0,0,15,67,15,"x2",15,null,{"$f":"M76*100/M1309","v":0.16354121238552116},5,"","",6,26,1,0,0,{"$f":"L76*100/B$1285","v":0}]
["2020-03-10T18:00:00",2,"Valle d'Aosta",2,0,2,15,17,2,2,0,0,17,89,15,15,"",null,{"$f":"M77*100/M1310","v":0.16750418760469013},-4,"","",2,22,1,0,0,{"$f":"L77*100/B$1285","v":0}]
["2020-03-11T17:00:00",2,"Valle d'Aosta",2,0,2,17,19,2,2,0,1,20,99,15,15,"",null,{"$f":"M78*100/M1311","v":0.16048788316482104},"","",1,3,10,0.95,0,0.05,{"$f":"L78*100/B$1285","v":35.335689045936398}]
["2020-03-12T17:00:00",2,"Valle d'Aosta",7,0,7,19,26,7,7,0,1,27,118,15,15,"",null,{"$f":"M79*100/M1312","v":0.17865413882088269},5,"","",7,19,0.96296296296296291,0,3.7037037037037035E-2,{"$f":"L79*100/B$1285","v":35.335689045936398}]
["2020-03-13T17:00:00",2,"Valle d'Aosta",6,0,6,21,27,1,1,0,1,28,189,15,15,"",null,{"$f":"M80*100/M1313","v":0.15855039637599094},-6,"","",1,71,0.9642857142857143,0,3.5714285714285712E-2,{"$f":"L80*100/B$1285","v":35.335689045936398}]
["2020-03-14T17:00:00",2,"Valle d'Aosta",12,0,12,29,41,14,14,0,1,42,231,42,"x2",42,null,{"$f":"M81*100/M1314","v":0.19851585763577068},13,"","",14,42,0.97619047619047616,0,2.3809523809523808E-2,{"$f":"L81*100/B$1285","v":35.335689045936398}]
["2020-03-15T17:00:00",2,"Valle d'Aosta",10,3,13,43,56,15,15,0,1,57,230,42,42,"",null,{"$f":"M82*100/M1315","v":0.23033094920596436},1,"","",15,-1,0.98245614035087714,0,1.7543859649122806E-2,{"$f":"L82*100/B$1285","v":35.335689045936398}]
["2020-03-16T17:00:00",2,"Valle d'Aosta",28,5,33,70,103,47,47,0,2,105,287,105,"x2",105,null,{"$f":"M83*100/M1316","v":0.37526804860614726},32,"",1,48,57,0.98095238095238091,0,1.9047619047619049E-2,{"$f":"L83*100/B$1285","v":70.671378091872796}]
["2020-03-17T17:00:00",2,"Valle d'Aosta",35,6,41,93,134,31,31,0,2,136,398,105,105,"",null,{"$f":"M84*100/M1317","v":0.43166381006792359},-16,"","",31,111,0.98529411764705888,0,1.4705882352941176E-2,{"$f":"L84*100/B$1285","v":70.671378091872796}]
["2020-03-18T17:00:00",2,"Valle d'Aosta",41,3,44,118,162,28,28,0,3,165,486,105,105,"",null,{"$f":"M85*100/M1318","v":0.46201663259877357},-3,"",1,29,88,0.98181818181818181,0,1.8181818181818181E-2,{"$f":"L85*100/B$1285","v":106.00706713780919}]
["2020-03-19T17:00:00",2,"Valle d'Aosta",47,9,56,153,209,47,47,0,6,215,608,215,"x2",215,null,{"$f":"M86*100/M1319","v":0.52394297550871205},19,"",3,50,122,0.97209302325581393,0,2.7906976744186046E-2,{"$f":"L86*100/B$1285","v":212.01413427561837}]
["2020-03-20T17:00:00",2,"Valle d'Aosta",54,9,63,194,257,48,48,0,7,264,814,215,215,"",null,{"$f":"M87*100/M1320","v":0.56145126645541354},1,"",1,49,{"$f":"IF(N87-N86=0,\"\",N87-N86)","v":206},0.97348484848484851,0,2.6515151515151516E-2,{"$f":"L87*100/B$1285","v":247.34982332155477}]
["2020-03-21T17:00:00",2,"Valle d'Aosta",62,15,77,227,304,47,47,1,8,313,884,215,215,"",null,{"$f":"M88*100/M1321","v":0.58419500541266933},-1,1,1,{"$f":"IF(M88-M87=0,\"\",M88-M87)","v":49},70,0.97124600638977632,3.1948881789137379E-3,2.5559105431309903E-2,{"$f":"L88*100/B$1285","v":282.68551236749119}]
["2020-03-22T17:00:00",2,"Valle d'Aosta",63,21,84,270,354,50,50,1,9,364,950,215,215,"",null,{"$f":"M89*100/M1322","v":0.61550948628631341},3,"",1,51,66,0.97252747252747251,2.7472527472527475E-3,2.4725274725274724E-2,{"$f":"L89*100/B$1285","v":318.02120141342755}]
["2020-03-23T17:00:00",2,"Valle d'Aosta",69,20,89,290,379,25,25,2,12,393,1098,215,215,"",null,{"$f":"M90*100/M1323","v":0.61476371486226478},-25,1,3,29,148,0.96437659033078882,5.0890585241730284E-3,3.0534351145038167E-2,{"$f":"L90*100/B$1285","v":424.02826855123675}]
["2020-03-24T17:00:00",2,"Valle d'Aosta",71,20,91,288,379,0,0,2,19,400,1180,215,215,"",null,{"$f":"M91*100/M1324","v":0.57823522608997335},-25,"",7,7,82,0.94750000000000001,5.0000000000000001E-3,4.7500000000000001E-2,{"$f":"L91*100/B$1285","v":671.37809187279152}]
["2020-03-25T17:00:00",2,"Valle d'Aosta",70,25,95,280,375,-4,-4,2,24,401,1200,215,215,"",null,{"$f":"M92*100/M1325","v":0.53907993439625734},-4,"",5,1,20,0.93516209476309231,4.9875311720698253E-3,5.9850374064837904E-2,{"$f":"L92*100/B$1285","v":848.0565371024735}]
["2020-03-26T17:00:00",2,"Valle d'Aosta",73,24,97,281,378,3,3,2,28,408,1203,215,215,"",null,{"$f":"M93*100/M1326","v":0.50658687095692767},7,"",4,7,{"$f":"IF(N93-N92=0,\"\",N93-N92)","v":3},0.92647058823529416,4.9019607843137254E-3,6.8627450980392163E-2,{"$f":"L93*100/B$1285","v":989.39929328621906}]
["2020-03-27T17:00:00",2,"Valle d'Aosta",91,24,115,298,413,35,44,2,37,452,1252,{"$f":"IF(P94=\"x2\",M94,O93)","v":452},{"$f":"IF(M94>O93*2,\"x2\",O93)","v":"x2"},{"$f":"IF(P94=\"x2\",M94,\"\")","v":452},null,{"$f":"M94*100/M1327","v":0.52255543480774125},{"$f":"IF(J94-J93=0,\"\",J94-J93)","v":41},"",9,44,49,0.91371681415929207,4.4247787610619468E-3,8.185840707964602E-2,{"$f":"L94*100/B$1285","v":1307.4204946996465}]
["2020-03-28T17:00:00",2,"Valle d'Aosta",90,26,116,352,468,55,59,2,41,511,1380,452,452,"",null,{"$f":"M95*100/M1328","v":0.55259970585690799},15,"",4,59,128,0.91585127201565553,3.9138943248532287E-3,8.0234833659491189E-2,{"$f":"L95*100/B$1285","v":1448.7632508833922}]
["2020-03-29T17:00:00",2,"Valle d'Aosta",90,26,116,423,539,71,73,2,43,584,1480,452,452,"",null,{"$f":"M96*100/M1329","v":0.59781551658835697},14,"",2,73,100,0.92294520547945202,3.4246575342465752E-3,7.3630136986301373E-2,{"$f":"L96*100/B$1285","v":1519.434628975265}]
["2020-03-30T17:00:00",2,"Valle d'Aosta",92,26,118,400,518,-21,0,16,50,584,1536,452,452,"",null,{"$f":"M97*100/M1330","v":0.57401782993738881},-73,14,7,"",56,0.88698630136986301,2.7397260273972601E-2,8.5616438356164379E-2,{"$f":"L97*100/B$1285","v":1766.7844522968198}]
["2020-03-31T17:00:00",2,"Valle d'Aosta",91,26,117,435,552,34,44,20,56,628,1582,452,452,"",null,{"$f":"M98*100/M1331","v":0.59361766485178469},44,4,6,44,46,0.87898089171974525,3.1847133757961783E-2,8.9171974522292988E-2,{"$f":"L98*100/B$1285","v":1978.7985865724381}]
["2020-04-01T17:00:00",2,"Valle d'Aosta",85,27,112,428,540,-12,3,32,59,631,1717,452,452,"",null,{"$f":"M99*100/M1332","v":0.57065856349593935},-41,12,3,3,{"$f":"IF(N99-N98=0,\"\",N99-N98)","v":135},{"$f":"IF(M99=0,0,H99/M99)","v":0.85578446909667194},{"$f":"IF(M99=0,0,K99/M99)","v":5.0713153724247229E-2},{"$f":"IF(M99=0,0,L99/M99)","v":9.3502377179080817E-2},{"$f":"L99*100/B$1285","v":2084.8056537102475}]
["2020-04-02T17:00:00",2,"Valle d'Aosta",85,25,110,446,556,16,37,49,63,668,1934,{"$f":"IF(P100=\"x2\",M100,O99)","v":452},{"$f":"IF(M100>O99*2,\"x2\",O99)","v":452},{"$f":"IF(P100=\"x2\",M100,\"\")","v":""},null,{"$f":"M100*100/M1333","v":0.57964978046198434},{"$f":"IF(J100-J99=0,\"\",J100-J99)","v":34},{"$f":"IF(K100-K99=0,\"\",K100-K99)","v":17},{"$f":"IF(L100-L99=0,\"\",L100-L99)","v":4},{"$f":"IF(M100-M99=0,\"\",M100-M99)","v":37},217,0.83233532934131738,7.3353293413173648E-2,9.4311377245508976E-2,{"$f":"L100*100/B$1285","v":2226.1484098939927}]
["2020-04-03T17:00:00",2,"Valle d'Aosta",85,25,110,450,560,4,51,89,70,719,2106,{"$f":"IF(P101=\"x2\",M101,O100)","v":452},{"$f":"IF(M101>O100*2,\"x2\",O100)","v":452},{"$f":"IF(P101=\"x2\",M101,\"\")","v":""},null,{"$f":"M101*100/M1334","v":0.60003171238535558},{"$f":"IF(J101-J100=0,\"\",J101-J100)","v":14},{"$f":"IF(K101-K100=0,\"\",K101-K100)","v":40},{"$f":"IF(L101-L100=0,\"\",L101-L100)","v":7},{"$f":"IF(M101-M100=0,\"\",M101-M100)","v":51},172,0.77885952712100137,0.12378303198887343,9.7357440890125171E-2,{"$f":"L101*100/B$1285","v":2473.4982332155478}]
["2020-04-04T17:00:00",2,"Valle d'Aosta",63,23,86,474,560,0,29,106,82,748,2274,{"$f":"IF(P102=\"x2\",M102,O101)","v":452},{"$f":"IF(M102>O101*2,\"x2\",O101)","v":452},{"$f":"IF(P102=\"x2\",M102,\"\")","v":""},null,{"$f":"M102*100/M1335","v":0.60016689132806988},{"$f":"IF(J102-J101=0,\"\",J102-J101)","v":-22},{"$f":"IF(K102-K101=0,\"\",K102-K101)","v":17},{"$f":"IF(L102-L101=0,\"\",L102-L101)","v":12},{"$f":"IF(M102-M101=0,\"\",M102-M101)","v":29},168,0.74866310160427807,0.14171122994652408,0.10962566844919786,{"$f":"L102*100/B$1285","v":2897.5265017667843}]
["2020-04-05T17:00:00",2,"Valle d'Aosta",96,23,119,457,576,16,34,115,91,782,2390,{"$f":"IF(P103=\"x2\",M103,O102)","v":452},{"$f":"IF(M103>O102*2,\"x2\",O102)","v":452},{"$f":"IF(P103=\"x2\",M103,\"\")","v":""},null,{"$f":"M103*100/M1336","v":0.60644600924403635},{"$f":"IF(J103-J102=0,\"\",J103-J102)","v":5},{"$f":"IF(K103-K102=0,\"\",K103-K102)","v":9},{"$f":"IF(L103-L102=0,\"\",L103-L102)","v":9},{"$f":"IF(M103-M102=0,\"\",M103-M102)","v":34},116,0.73657289002557547,0.14705882352941177,0.11636828644501279,{"$f":"L103*100/B$1285","v":3215.547703180212}]
["2020-04-06T17:00:00",2,"Valle d'Aosta",109,21,130,437,567,-9,23,142,96,805,2590,{"$f":"IF(P104=\"x2\",M104,O103)","v":452},{"$f":"IF(M104>O103*2,\"x2\",O103)","v":452},{"$f":"IF(P104=\"x2\",M104,\"\")","v":""},null,{"$f":"M104*100/M1337","v":0.60733173893034165},{"$f":"IF(J104-J103=0,\"\",J104-J103)","v":-11},{"$f":"IF(K104-K103=0,\"\",K104-K103)","v":27},{"$f":"IF(L104-L103=0,\"\",L104-L103)","v":5},{"$f":"IF(M104-M103=0,\"\",M104-M103)","v":23},200,0.70434782608695656,0.1763975155279503,0.11925465838509317,{"$f":"L104*100/B$1285","v":3392.226148409894}]
["2020-04-07T17:00:00",2,"Valle d'Aosta",118,17,135,458,593,26,30,142,100,835,2754,{"$f":"IF(P105=\"x2\",M105,O104)","v":452},{"$f":"IF(M105>O104*2,\"x2\",O104)","v":452},{"$f":"IF(P105=\"x2\",M105,\"\")","v":""},null,{"$f":"M105*100/M1338","v":0.61584529376189279},{"$f":"IF(J105-J104=0,\"\",J105-J104)","v":7},{"$f":"IF(K105-K104=0,\"\",K105-K104)","v":""},{"$f":"IF(L105-L104=0,\"\",L105-L104)","v":4},{"$f":"IF(M105-M104=0,\"\",M105-M104)","v":30},{"$f":"IF(N105-N104=0,\"\",N105-N104)","v":164},{"$f":"IF(M105=0,0,H105/M105)","v":0.71017964071856288},{"$f":"IF(M105=0,0,K105/M105)","v":0.17005988023952096},{"$f":"IF(M105=0,0,L105/M105)","v":0.11976047904191617},{"$f":"L105*100/B$1285","v":3533.5689045936397}]
["2020-04-08T17:00:00",2,"Valle d'Aosta",120,20,140,466,606,13,15,142,102,850,2953,{"$f":"IF(P106=\"x2\",M106,O105)","v":452},{"$f":"IF(M106>O105*2,\"x2\",O105)","v":452},{"$f":"IF(P106=\"x2\",M106,\"\")","v":""},null,{"$f":"M106*100/M1339","v":0.60965988151080897},{"$f":"IF(J106-J105=0,\"\",J106-J105)","v":-15},{"$f":"IF(K106-K105=0,\"\",K106-K105)","v":""},{"$f":"IF(L106-L105=0,\"\",L106-L105)","v":2},{"$f":"IF(M106-M105=0,\"\",M106-M105)","v":15},{"$f":"IF(N106-N105=0,\"\",N106-N105)","v":199},{"$f":"IF(M106=0,0,H106/M106)","v":0.71294117647058819},{"$f":"IF(M106=0,0,K106/M106)","v":0.16705882352941176},{"$f":"IF(M106=0,0,L106/M106)","v":0.12},{"$f":"L106*100/B$1285","v":3604.2402826855123}]
["2020-04-09T17:00:00",2,"Valle d'Aosta",118,18,136,473,609,3,18,154,105,868,3142,{"$f":"IF(P107=\"x2\",M107,O106)","v":452},{"$f":"IF(M107>O106*2,\"x2\",O106)","v":452},{"$f":"IF(P107=\"x2\",M107,\"\")","v":""},null,{"$f":"M107*100/M1340","v":0.6043474022809241},{"$f":"IF(J107-J106=0,\"\",J107-J106)","v":3},{"$f":"IF(K107-K106=0,\"\",K107-K106)","v":12},{"$f":"IF(L107-L106=0,\"\",L107-L106)","v":3},{"$f":"IF(M107-M106=0,\"\",M107-M106)","v":18},{"$f":"IF(N107-N106=0,\"\",N107-N106)","v":189},{"$f":"IF(M107=0,0,H107/M107)","v":0.70161290322580649},{"$f":"IF(M107=0,0,K107/M107)","v":0.17741935483870969},{"$f":"IF(M107=0,0,L107/M107)","v":0.12096774193548387},{"$f":"L107*100/B$1285","v":3710.2473498233217}]
["2020-04-10T17:00:00",2,"Valle d'Aosta",131,16,147,455,602,-7,11,170,107,879,3328,{"$f":"IF(P108=\"x2\",M108,O107)","v":452},{"$f":"IF(M108>O107*2,\"x2\",O107)","v":452},{"$f":"IF(P108=\"x2\",M108,\"\")","v":""},null,{"$f":"M108*100/M1341","v":0.5956212688969148},{"$f":"IF(J108-J107=0,\"\",J108-J107)","v":-7},{"$f":"IF(K108-K107=0,\"\",K108-K107)","v":16},{"$f":"IF(L108-L107=0,\"\",L108-L107)","v":2},{"$f":"IF(M108-M107=0,\"\",M108-M107)","v":11},{"$f":"IF(N108-N107=0,\"\",N108-N107)","v":186},{"$f":"IF(M108=0,0,H108/M108)","v":0.68486916951080778},{"$f":"IF(M108=0,0,K108/M108)","v":0.19340159271899887},{"$f":"IF(M108=0,0,L108/M108)","v":0.1217292377701934},{"$f":"L108*100/B$1285","v":3780.9187279151943}]
["2020-04-11T17:00:00",2,"Valle d'Aosta",118,17,135,455,590,-12,23,205,107,902,3464,{"$f":"IF(P109=\"x2\",M109,O108)","v":452},{"$f":"IF(M109>O108*2,\"x2\",O108)","v":452},{"$f":"IF(P109=\"x2\",M109,\"\")","v":""},null,{"$f":"M109*100/M1342","v":0.59236492831858989},{"$f":"IF(J109-J108=0,\"\",J109-J108)","v":12},{"$f":"IF(K109-K108=0,\"\",K109-K108)","v":35},{"$f":"IF(L109-L108=0,\"\",L109-L108)","v":""},{"$f":"IF(M109-M108=0,\"\",M109-M108)","v":23},{"$f":"IF(N109-N108=0,\"\",N109-N108)","v":136},{"$f":"IF(M109=0,0,H109/M109)","v":0.65410199556541015},{"$f":"IF(M109=0,0,K109/M109)","v":0.22727272727272727},{"$f":"IF(M109=0,0,L109/M109)","v":0.11862527716186252},{"$f":"L109*100/B$1285","v":3780.9187279151943}]
["2020-04-12T17:00:00",2,"Valle d'Aosta",109,16,125,463,588,-2,19,221,112,921,3510,{"$f":"IF(P110=\"x2\",M110,O109)","v":921},{"$f":"IF(M110>O109*2,\"x2\",O109)","v":"x2"},{"$f":"IF(P110=\"x2\",M110,\"\")","v":921},null,{"$f":"M110*100/M1343","v":0.58901402505707867},{"$f":"IF(J110-J109=0,\"\",J110-J109)","v":-4},{"$f":"IF(K110-K109=0,\"\",K110-K109)","v":16},{"$f":"IF(L110-L109=0,\"\",L110-L109)","v":5},{"$f":"IF(M110-M109=0,\"\",M110-M109)","v":19},{"$f":"IF(N110-N109=0,\"\",N110-N109)","v":46},{"$f":"IF(M110=0,0,H110/M110)","v":0.6384364820846905},{"$f":"IF(M110=0,0,K110/M110)","v":0.23995656894679696},{"$f":"IF(M110=0,0,L110/M110)","v":0.12160694896851248},{"$f":"L110*100/B$1285","v":3957.5971731448763}]
["2020-04-13T17:00:00",2,"Valle d'Aosta",109,15,124,458,582,-6,6,230,115,927,3614,{"$f":"IF(P111=\"x2\",M111,O110)","v":921},{"$f":"IF(M111>O110*2,\"x2\",O110)","v":921},{"$f":"IF(P111=\"x2\",M111,\"\")","v":""},null,{"$f":"M111*100/M1344","v":0.58113292710449105},{"$f":"IF(J111-J110=0,\"\",J111-J110)","v":-13},{"$f":"IF(K111-K110=0,\"\",K111-K110)","v":9},{"$f":"IF(L111-L110=0,\"\",L111-L110)","v":3},{"$f":"IF(M111-M110=0,\"\",M111-M110)","v":6},{"$f":"IF(N111-N110=0,\"\",N111-N110)","v":104},{"$f":"IF(M111=0,0,H111/M111)","v":0.62783171521035597},{"$f":"IF(M111=0,0,K111/M111)","v":0.24811218985976269},{"$f":"IF(M111=0,0,L111/M111)","v":0.12405609492988134},{"$f":"L111*100/B$1285","v":4063.6042402826856}]
["2020-04-14T17:00:00",2,"Valle d'Aosta",112,14,126,433,559,-23,20,270,118,947,3726,{"$f":"IF(P112=\"x2\",M112,O111)","v":921},{"$f":"IF(M112>O111*2,\"x2\",O111)","v":921},{"$f":"IF(P112=\"x2\",M112,\"\")","v":""},null,{"$f":"M112*100/M1345","v":0.58281226921372653},{"$f":"IF(J112-J111=0,\"\",J112-J111)","v":14},{"$f":"IF(K112-K111=0,\"\",K112-K111)","v":40},{"$f":"IF(L112-L111=0,\"\",L112-L111)","v":3},{"$f":"IF(M112-M111=0,\"\",M112-M111)","v":20},{"$f":"IF(N112-N111=0,\"\",N112-N111)","v":112},{"$f":"IF(M112=0,0,H112/M112)","v":0.59028511087645197},{"$f":"IF(M112=0,0,K112/M112)","v":0.28511087645195354},{"$f":"IF(M112=0,0,L112/M112)","v":0.1246040126715945},{"$f":"L112*100/B$1285","v":4169.611307420495}]
["2020-04-15T17:00:00",2,"Valle d'Aosta",112,11,123,425,548,-11,11,289,121,958,3894,{"$f":"IF(P113=\"x2\",M113,O112)","v":921},{"$f":"IF(M113>O112*2,\"x2\",O112)","v":921},{"$f":"IF(P113=\"x2\",M113,\"\")","v":""},null,{"$f":"M113*100/M1346","v":0.58006115467288299},{"$f":"IF(J113-J112=0,\"\",J113-J112)","v":-9},{"$f":"IF(K113-K112=0,\"\",K113-K112)","v":19},{"$f":"IF(L113-L112=0,\"\",L113-L112)","v":3},{"$f":"IF(M113-M112=0,\"\",M113-M112)","v":11},{"$f":"IF(N113-N112=0,\"\",N113-N112)","v":168},{"$f":"IF(M113=0,0,H113/M113)","v":0.57202505219206679},{"$f":"IF(M113=0,0,K113/M113)","v":0.30167014613778703},{"$f":"IF(M113=0,0,L113/M113)","v":0.12630480167014613},{"$f":"L113*100/B$1285","v":4275.6183745583039}]
[{"$f":"A113 + 1","v":"2020-04-16T17:00:00"},null,null,null,null,null,null,null,null,null,null,null,null,null,null,"Media x2",{"$f":"COUNT(M62:M113) / COUNT(Q62:Q113)","v":5.7777777777777777}]
[{"$f":"A114+1","v":"2020-04-17T17:00:00"}]
[{"$f":"A115+1","v":"2020-04-18T17:00:00"}]
[null,null,null,null,{"$f":"E113/$M113","v":1.1482254697286013E-2},null,null,{"$f":"H113/$M113","v":0.57202505219206679},null,null,{"$f":"K113/$M113","v":0.30167014613778703},{"$f":"L113/$M113","v":0.12630480167014613},null,{"$f":"N113/$M113","v":4.0647181628392488}]
[]
[]
[]
["Data","Codice","Regione","Ricoverati","Terap. Intens.","Ospedalizzati","Quarantena","Positivi","+ Positivi","Nuovi","Guariti","Deceduti","Totale","Tamponi",null,null,"x 2",null,"% su Tot.","+ Nuovi","+ Guariti","+ Deceduti","+ Totali","+ Tamponi","% Positivi","% Guariti","% Deceduti","P. Stimati"]
["2020-02-24T18:00:00",3,"Lombardia",76,19,95,71,166,0,166,0,6,172,1463,{"$f":"M122","v":172},null,{"$f":"M122","v":172},null,{"$f":"M122*100/M1295","v":75.109170305676855},null,null,null,null,null,{"$f":"IF(M122=0,0,H122/M122)","v":0.96511627906976749},{"$f":"IF(M122=0,0,K122/M122)","v":0},{"$f":"IF(M122=0,0,L122/M122)","v":3.4883720930232558E-2},{"$f":"L122*100/B$1285","v":212.01413427561837}]
["2020-02-25T18:00:00",3,"Lombardia",79,25,104,127,231,65,65,0,9,240,3700,{"$f":"IF(P123=\"x2\",M123,O122)","v":172},{"$f":"IF(M123>O122*2,\"x2\",O122)","v":172},{"$f":"IF(P123=\"x2\",M123,\"\")","v":""},null,{"$f":"M123*100/M1296","v":74.534161490683232},{"$f":"IF(J123-J122=0,\"\",J123-J122)","v":-101},{"$f":"IF(K123-K122=0,\"\",K123-K122)","v":""},{"$f":"IF(L123-L122=0,\"\",L123-L122)","v":3},{"$f":"IF(M123-M122=0,\"\",M123-M122)","v":68},{"$f":"IF(N123-N122=0,\"\",N123-N122)","v":2237},0.96250000000000002,0,3.7499999999999999E-2,{"$f":"L123*100/B$1285","v":318.02120141342755}]
["2020-02-26T18:00:00",3,"Lombardia",79,25,104,145,249,18,18,0,9,258,3208,172,172,"",null,{"$f":"M124*100/M1297","v":64.5},-47,"","",18,-492,0.96511627906976749,0,3.4883720930232558E-2,{"$f":"L124*100/B$1285","v":318.02120141342755}]
["2020-02-27T18:00:00",3,"Lombardia",172,41,213,136,349,100,100,40,14,403,3320,403,"x2",403,null,{"$f":"M125*100/M1298","v":62},82,40,5,145,112,0.86600496277915628,9.9255583126550875E-2,3.4739454094292806E-2,{"$f":"L125*100/B$1285","v":494.69964664310953}]
["2020-02-28T18:00:00",3,"Lombardia",235,47,282,192,474,125,125,40,17,531,4835,403,403,"",null,{"$f":"M126*100/M1299","v":59.797297297297298},25,"",3,128,1515,0.89265536723163841,7.5329566854990579E-2,3.2015065913370999E-2,{"$f":"L126*100/B$1285","v":600.70671378091868}]
["2020-02-29T17:00:00",3,"Lombardia",256,80,336,216,552,78,78,40,23,615,5723,403,403,"",null,{"$f":"M127*100/M1300","v":54.521276595744681},-47,"",6,84,888,0.89756097560975612,6.5040650406504072E-2,3.7398373983739838E-2,{"$f":"L127*100/B$1285","v":812.72084805653708}]
["2020-03-01T17:00:00",3,"Lombardia",406,106,512,375,887,335,335,73,24,984,6879,984,"x2",984,null,{"$f":"M128*100/M1301","v":58.087367178276267},257,33,1,369,1156,0.90142276422764223,7.41869918699187E-2,2.4390243902439025E-2,{"$f":"L128*100/B$1285","v":848.0565371024735}]
["2020-03-02T18:00:00",3,"Lombardia",478,127,605,472,1077,190,190,139,38,1254,7925,984,984,"",null,{"$f":"M129*100/M1302","v":61.591355599214147},-145,66,14,270,1046,0.85885167464114831,0.11084529505582137,3.0303030303030304E-2,{"$f":"L129*100/B$1285","v":1342.756183745583}]
["2020-03-03T18:00:00",3,"Lombardia",698,167,865,461,1326,249,249,139,55,1520,9577,984,984,"",null,{"$f":"M130*100/M1303","v":60.75139888089528},59,"",17,266,1652,0.87236842105263157,9.1447368421052638E-2,3.6184210526315791E-2,{"$f":"L130*100/B$1285","v":1943.4628975265018}]
["2020-03-04T17:00:00",3,"Lombardia",877,209,1086,411,1497,171,171,250,73,1820,12138,984,984,"",null,{"$f":"M131*100/M1304","v":58.918743930074456},-78,111,18,300,2561,0.82252747252747249,0.13736263736263737,4.0109890109890113E-2,{"$f":"L131*100/B$1285","v":2579.5053003533567}]
["2020-03-05T17:00:00",3,"Lombardia",1169,244,1413,364,1777,280,280,376,98,2251,12354,2251,"x2",2251,null,{"$f":"M132*100/M1305","v":58.346293416277867},109,126,25,431,216,0.78942692136828074,0.16703687250111063,4.3536206130608615E-2,{"$f":"L132*100/B$1285","v":3462.8975265017666}]
["2020-03-06T17:00:00",3,"Lombardia",1622,309,1931,77,2008,231,231,469,135,2612,13556,2251,2251,"",null,{"$f":"M133*100/M1306","v":56.341673856773077},-49,93,37,361,1202,0.76875957120980087,0.17955589586523737,5.1684532924961717E-2,{"$f":"L133*100/B$1285","v":4770.3180212014131}]
["2020-03-07T18:00:00",3,"Lombardia",1661,359,2020,722,2742,734,734,524,154,3420,15778,2251,2251,"",null,{"$f":"M134*100/M1307","v":58.133605303416623},503,55,19,808,2222,0.80175438596491233,0.15321637426900586,4.502923976608187E-2,{"$f":"L134*100/B$1285","v":5441.6961130742047}]
["2020-03-08T18:00:00",3,"Lombardia",2217,399,2616,756,3372,630,630,550,267,4189,18534,2251,2251,"",null,{"$f":"M135*100/M1308","v":56.8},-104,26,113,769,2756,0.80496538553354025,0.13129625208880402,6.3738362377655761E-2,{"$f":"L135*100/B$1285","v":9434.6289752650173}]
["2020-03-09T18:00:00",3,"Lombardia",2802,440,3242,1248,4490,1118,1118,646,333,5469,20135,5469,"x2",5469,null,{"$f":"M136*100/M1309","v":59.627126035761009},488,96,66,1280,1601,0.82099104040958126,0.11812031449990858,6.0888645090510146E-2,{"$f":"L136*100/B$1285","v":11766.784452296819}]
["2020-03-10T18:00:00",3,"Lombardia",3319,466,3785,642,4427,-63,-63,896,468,5791,21479,5469,5469,"",null,{"$f":"M137*100/M1310","v":57.059808848162383},-1181,250,135,322,1344,0.76446209635641516,0.15472284579519946,8.0815057848385427E-2,{"$f":"L137*100/B$1285","v":16537.102473498231}]
["2020-03-11T17:00:00",3,"Lombardia",3852,560,4412,1351,5763,1336,1336,900,617,7280,25629,5469,5469,"",null,{"$f":"M138*100/M1311","v":58.417589471994866},1399,4,149,1489,4150,0.79162087912087908,0.12362637362637363,8.4752747252747257E-2,{"$f":"L138*100/B$1285","v":21802.120141342755}]
["2020-03-12T17:00:00",3,"Lombardia",4247,605,4852,2044,6896,1133,1133,1085,744,8725,29534,5469,5469,"",null,{"$f":"M139*100/M1312","v":57.731754118970422},-203,185,127,1445,3905,0.79037249283667621,0.12435530085959885,8.5272206303724923E-2,{"$f":"L139*100/B$1285","v":26289.752650176677}]
["2020-03-13T17:00:00",3,"Lombardia",4435,650,5085,2647,7732,836,836,1198,890,9820,32700,5469,5469,"",null,{"$f":"M140*100/M1313","v":55.605889014722536},-297,113,146,1095,3166,0.78737270875763743,0.12199592668024439,9.0631364562118122E-2,{"$f":"L140*100/B$1285","v":31448.763250883392}]
["2020-03-14T17:00:00",3,"Lombardia",4898,732,5630,3429,9059,1327,1327,1660,966,11685,37138,11685,"x2",11685,null,{"$f":"M141*100/M1314","v":55.229947535094766},491,462,76,1865,4438,0.77526743688489519,0.14206247325631152,8.267008985879333E-2,{"$f":"L141*100/B$1285","v":34134.275618374559}]
["2020-03-15T17:00:00",3,"Lombardia",5500,767,6267,3776,10043,984,984,2011,1218,13272,40369,11685,11685,"",null,{"$f":"M142*100/M1315","v":53.630743120378227},-343,351,252,1587,3231,0.75670584689572029,0.15152200120554551,9.1772151898734181E-2,{"$f":"L142*100/B$1285","v":43038.86925795053}]
["2020-03-16T17:00:00",3,"Lombardia",6171,823,6994,3867,10861,818,818,2368,1420,14649,43565,11685,11685,"",null,{"$f":"M143*100/M1316","v":52.355253752680483},-166,357,202,1377,3196,0.74141579630008869,0.16164925933510821,9.6934944364803058E-2,{"$f":"L143*100/B$1285","v":50176.678445229678}]
["2020-03-17T17:00:00",3,"Lombardia",6953,879,7832,4263,12095,1234,1234,2485,1640,16220,46449,11685,11685,"",null,{"$f":"M144*100/M1317","v":51.482257347806765},416,117,220,1571,2884,0.74568434032059183,0.15320591861898891,0.10110974106041924,{"$f":"L144*100/B$1285","v":57950.530035335687}]
["2020-03-18T17:00:00",3,"Lombardia",7285,924,8209,4057,12266,171,171,3488,1959,17713,48983,11685,11685,"",null,{"$f":"M145*100/M1318","v":49.598185534679246},-1063,1003,319,1493,2534,0.6924857449331,0.19691751820696662,0.11059673685993338,{"$f":"L145*100/B$1285","v":69222.614840989394}]
["2020-03-19T17:00:00",3,"Lombardia",7387,1006,8393,5545,13938,1672,1672,3778,2168,19884,52244,11685,11685,"",null,{"$f":"M146*100/M1319","v":48.456195930303402},1501,290,209,2171,3261,0.70096560048280021,0.1900020116676725,0.10903238784952726,{"$f":"L146*100/B$1285","v":76607.7738515901}]
["2020-03-20T17:00:00",3,"Lombardia",7735,1050,8785,6635,15420,1482,1482,4295,2549,22264,57174,11685,11685,"",null,{"$f":"M147*100/M1320","v":47.349056804406544},-190,517,381,2380,{"$f":"IF(N147-N146=0,\"\",N147-N146)","v":4930},0.69259791591807407,0.19291232482932089,0.1144897592526051,{"$f":"L147*100/B$1285","v":90070.671378091865}]
["2020-03-21T17:00:00",3,"Lombardia",8258,1093,9351,8019,17370,1950,1950,5050,3095,25515,66730,25515,"x2",25515,null,{"$f":"M148*100/M1321","v":47.622158348575908},468,755,546,{"$f":"IF(M148-M147=0,\"\",M148-M147)","v":3251},9556,0.6807760141093474,0.19792279051538311,0.12130119537526945,{"$f":"L148*100/B$1285","v":109363.95759717314}]
["2020-03-22T17:00:00",3,"Lombardia",9439,1142,10581,7304,17885,515,515,5865,3456,27206,70598,25515,25515,"",null,{"$f":"M149*100/M1322","v":46.004261219520444},-1435,815,361,1691,3868,0.65739175181945164,0.2155774461515842,0.12703080202896419,{"$f":"L149*100/B$1285","v":122120.14134275618}]
["2020-03-23T17:00:00",3,"Lombardia",9266,1183,10449,8461,18910,1025,1025,6075,3776,28761,73242,25515,25515,"",null,{"$f":"M150*100/M1323","v":44.99037965179032},510,210,320,1555,2644,0.65748756997322766,0.21122353186606863,0.13128889816070374,{"$f":"L150*100/B$1285","v":133427.56183745584}]
["2020-03-24T17:00:00",3,"Lombardia",9711,1194,10905,8963,19868,958,958,6657,4178,30703,76695,25515,25515,"",null,{"$f":"M151*100/M1324","v":44.383890366601136},-67,582,402,1942,3453,0.64710288896850465,0.21681920333517898,0.13607790769631631,{"$f":"L151*100/B$1285","v":147632.50883392227}]
["2020-03-25T17:00:00",3,"Lombardia",10026,1236,11262,9329,20591,723,723,7281,4474,32346,81666,25515,25515,"",null,{"$f":"M152*100/M1325","v":43.483988922646738},-235,624,296,1643,4971,0.63658566747047551,0.22509738452977185,0.13831694799975267,{"$f":"L152*100/B$1285","v":158091.87279151942}]
["2020-03-26T17:00:00",3,"Lombardia",10681,1263,11944,10245,22189,1598,1598,7839,4861,34889,87713,25515,25515,"",null,{"$f":"M153*100/M1326","v":43.319385639255515},875,558,387,2543,{"$f":"IF(N153-N152=0,\"\",N153-N152)","v":6047},0.63598842041904324,0.22468399782166298,0.13932758175929377,{"$f":"L153*100/B$1285","v":171766.78445229682}]
["2020-03-27T17:00:00",3,"Lombardia",11137,1292,12429,11466,23895,1706,2409,8001,5402,37298,95860,{"$f":"IF(P154=\"x2\",M154,O153)","v":25515},{"$f":"IF(M154>O153*2,\"x2\",O153)","v":25515},{"$f":"IF(P154=\"x2\",M154,\"\")","v":""},null,{"$f":"M154*100/M1327","v":43.12007214039631},{"$f":"IF(J154-J153=0,\"\",J154-J153)","v":811},162,541,2409,8147,0.64065097324253306,0.21451552362056947,0.14483350313689741,{"$f":"L154*100/B$1285","v":190883.3922261484}]
["2020-03-28T17:00:00",3,"Lombardia",11152,1319,12471,12038,24509,614,2117,8962,5944,39415,102503,25515,25515,"",null,{"$f":"M155*100/M1328","v":42.623713123972664},-292,961,542,2117,6643,0.62181910440187749,0.22737536470886718,0.15080553088925536,{"$f":"L155*100/B$1285","v":210035.33568904593}]
["2020-03-29T17:00:00",3,"Lombardia",11613,1328,12941,12451,25392,883,1592,9255,6360,41007,107398,25515,25515,"",null,{"$f":"M156*100/M1329","v":41.97709056290882},-525,293,416,1592,4895,0.61921135415904605,0.22569317433608896,0.15509547150486502,{"$f":"L156*100/B$1285","v":224734.98233215546}]
["2020-03-30T17:00:00",3,"Lombardia",11815,1330,13145,11861,25006,-386,1154,10337,6818,42161,111057,25515,25515,"",null,{"$f":"M157*100/M1330","v":41.440352273955909},-438,1082,458,1154,3659,0.59310737411351722,0.24517919404188704,0.16171343184459572,{"$f":"L157*100/B$1285","v":240918.72791519435}]
["2020-03-31T17:00:00",3,"Lombardia",11883,1324,13207,11917,25124,118,1047,10885,7199,43208,114640,25515,25515,"",null,{"$f":"M158*100/M1331","v":40.842407743496672},-107,548,381,1047,3583,0.58146639511201625,0.25192094056656172,0.16661266432142197,{"$f":"L158*100/B$1285","v":254381.62544169612}]
["2020-04-01T17:00:00",3,"Lombardia",11927,1342,13269,12496,25765,641,1565,11415,7593,44773,121449,25515,25515,"",null,{"$f":"M159*100/M1332","v":40.491435599688899},518,530,394,1565,{"$f":"IF(N159-N158=0,\"\",N159-N158)","v":6809},{"$f":"IF(M159=0,0,H159/M159)","v":0.57545842360351107},{"$f":"IF(M159=0,0,K159/M159)","v":0.25495276170906572},{"$f":"IF(M159=0,0,L159/M159)","v":0.16958881468742323},{"$f":"L159*100/B$1285","v":268303.88692579506}]
["2020-04-02T17:00:00",3,"Lombardia",11762,1351,13113,12763,25876,111,1292,12229,7960,46065,128286,{"$f":"IF(P160=\"x2\",M160,O159)","v":25515},{"$f":"IF(M160>O159*2,\"x2\",O159)","v":25515},{"$f":"IF(P160=\"x2\",M160,\"\")","v":""},null,{"$f":"M160*100/M1333","v":39.972405893684595},{"$f":"IF(J160-J159=0,\"\",J160-J159)","v":-273},{"$f":"IF(K160-K159=0,\"\",K160-K159)","v":814},{"$f":"IF(L160-L159=0,\"\",L160-L159)","v":367},{"$f":"IF(M160-M159=0,\"\",M160-M159)","v":1292},6837,0.56172799305329424,0.26547270161727993,0.17279930532942581,{"$f":"L160*100/B$1285","v":281272.08480565372}]
["2020-04-03T17:00:00",3,"Lombardia",11802,1381,13183,13006,26189,313,1455,13020,8311,47520,135051,{"$f":"IF(P161=\"x2\",M161,O160)","v":25515},{"$f":"IF(M161>O160*2,\"x2\",O160)","v":25515},{"$f":"IF(P161=\"x2\",M161,\"\")","v":""},null,{"$f":"M161*100/M1334","v":39.657172423577322},{"$f":"IF(J161-J160=0,\"\",J161-J160)","v":163},{"$f":"IF(K161-K160=0,\"\",K161-K160)","v":791},{"$f":"IF(L161-L160=0,\"\",L161-L160)","v":351},{"$f":"IF(M161-M160=0,\"\",M161-M160)","v":1455},6765,0.55111531986531992,0.27398989898989901,0.17489478114478116,{"$f":"L161*100/B$1285","v":293674.9116607774}]
["2020-04-04T17:00:00",3,"Lombardia",12002,1326,13328,13892,27220,1031,1598,13242,8656,49118,141877,{"$f":"IF(P162=\"x2\",M162,O161)","v":25515},{"$f":"IF(M162>O161*2,\"x2\",O161)","v":25515},{"$f":"IF(P162=\"x2\",M162,\"\")","v":""},null,{"$f":"M162*100/M1335","v":39.410424289107134},{"$f":"IF(J162-J161=0,\"\",J162-J161)","v":143},{"$f":"IF(K162-K161=0,\"\",K162-K161)","v":222},{"$f":"IF(L162-L161=0,\"\",L162-L161)","v":345},{"$f":"IF(M162-M161=0,\"\",M162-M161)","v":1598},6826,0.55417565861802187,0.26959566757604136,0.17622867380593674,{"$f":"L162*100/B$1285","v":305865.72438162542}]
["2020-04-05T17:00:00",3,"Lombardia",12009,1317,13326,14798,28124,904,1337,13426,8905,50455,149984,{"$f":"IF(P163=\"x2\",M163,O162)","v":25515},{"$f":"IF(M163>O162*2,\"x2\",O162)","v":25515},{"$f":"IF(P163=\"x2\",M163,\"\")","v":""},null,{"$f":"M163*100/M1336","v":39.128175698731269},{"$f":"IF(J163-J162=0,\"\",J163-J162)","v":-261},{"$f":"IF(K163-K162=0,\"\",K163-K162)","v":184},{"$f":"IF(L163-L162=0,\"\",L163-L162)","v":249},{"$f":"IF(M163-M162=0,\"\",M163-M162)","v":1337},8107,0.55740759092260428,0.26609850361708454,0.17649390546031116,{"$f":"L163*100/B$1285","v":314664.31095406361}]
["2020-04-06T17:00:00",3,"Lombardia",11914,1343,13257,15212,28469,345,1079,13863,9202,51534,154989,{"$f":"IF(P164=\"x2\",M164,O163)","v":51534},{"$f":"IF(M164>O163*2,\"x2\",O163)","v":"x2"},{"$f":"IF(P164=\"x2\",M164,\"\")","v":51534},null,{"$f":"M164*100/M1337","v":38.879793582653697},{"$f":"IF(J164-J163=0,\"\",J164-J163)","v":-258},{"$f":"IF(K164-K163=0,\"\",K164-K163)","v":437},{"$f":"IF(L164-L163=0,\"\",L164-L163)","v":297},{"$f":"IF(M164-M163=0,\"\",M164-M163)","v":1079},5005,0.55243140450964412,0.26900686925136802,0.17856172623898786,{"$f":"L164*100/B$1285","v":325159.01060070668}]
["2020-04-07T17:00:00",3,"Lombardia",11833,1305,13138,15205,28343,-126,791,14498,9484,52325,159331,{"$f":"IF(P165=\"x2\",M165,O164)","v":51534},{"$f":"IF(M165>O164*2,\"x2\",O164)","v":51534},{"$f":"IF(P165=\"x2\",M165,\"\")","v":""},null,{"$f":"M165*100/M1338","v":38.591742510288675},{"$f":"IF(J165-J164=0,\"\",J165-J164)","v":-288},{"$f":"IF(K165-K164=0,\"\",K165-K164)","v":635},{"$f":"IF(L165-L164=0,\"\",L165-L164)","v":282},{"$f":"IF(M165-M164=0,\"\",M165-M164)","v":791},{"$f":"IF(N165-N164=0,\"\",N165-N164)","v":4342},{"$f":"IF(M165=0,0,H165/M165)","v":0.54167224080267562},{"$f":"IF(M165=0,0,K165/M165)","v":0.27707596751075014},{"$f":"IF(M165=0,0,L165/M165)","v":0.18125179168657429},{"$f":"L165*100/B$1285","v":335123.67491166078}]
["2020-04-08T17:00:00",3,"Lombardia",11719,1257,12976,15569,28545,202,1089,15147,9722,53414,167557,{"$f":"IF(P166=\"x2\",M166,O165)","v":51534},{"$f":"IF(M166>O165*2,\"x2\",O165)","v":51534},{"$f":"IF(P166=\"x2\",M166,\"\")","v":""},null,{"$f":"M166*100/M1339","v":38.31102695413923},{"$f":"IF(J166-J165=0,\"\",J166-J165)","v":298},{"$f":"IF(K166-K165=0,\"\",K166-K165)","v":649},{"$f":"IF(L166-L165=0,\"\",L166-L165)","v":238},{"$f":"IF(M166-M165=0,\"\",M166-M165)","v":1089},{"$f":"IF(N166-N165=0,\"\",N166-N165)","v":8226},{"$f":"IF(M166=0,0,H166/M166)","v":0.53441045418804056},{"$f":"IF(M166=0,0,K166/M166)","v":0.28357733927434753},{"$f":"IF(M166=0,0,L166/M166)","v":0.18201220653761185},{"$f":"L166*100/B$1285","v":343533.56890459365}]
["2020-04-09T17:00:00",3,"Lombardia",11796,1236,13032,16042,29074,529,1388,15706,10022,54802,176953,{"$f":"IF(P167=\"x2\",M167,O166)","v":51534},{"$f":"IF(M167>O166*2,\"x2\",O166)","v":51534},{"$f":"IF(P167=\"x2\",M167,\"\")","v":""},null,{"$f":"M167*100/M1340","v":38.156044170275578},{"$f":"IF(J167-J166=0,\"\",J167-J166)","v":299},{"$f":"IF(K167-K166=0,\"\",K167-K166)","v":559},{"$f":"IF(L167-L166=0,\"\",L167-L166)","v":300},{"$f":"IF(M167-M166=0,\"\",M167-M166)","v":1388},{"$f":"IF(N167-N166=0,\"\",N167-N166)","v":9396},{"$f":"IF(M167=0,0,H167/M167)","v":0.53052808291668185},{"$f":"IF(M167=0,0,K167/M167)","v":0.28659537973066679},{"$f":"IF(M167=0,0,L167/M167)","v":0.18287653735265136},{"$f":"L167*100/B$1285","v":354134.27561837452}]
["2020-04-10T17:00:00",3,"Lombardia",11877,1202,13079,16451,29530,456,1246,16280,10238,56048,186325,{"$f":"IF(P168=\"x2\",M168,O167)","v":51534},{"$f":"IF(M168>O167*2,\"x2\",O167)","v":51534},{"$f":"IF(P168=\"x2\",M168,\"\")","v":""},null,{"$f":"M168*100/M1341","v":37.978817837467901},{"$f":"IF(J168-J167=0,\"\",J168-J167)","v":-142},{"$f":"IF(K168-K167=0,\"\",K168-K167)","v":574},{"$f":"IF(L168-L167=0,\"\",L168-L167)","v":216},{"$f":"IF(M168-M167=0,\"\",M168-M167)","v":1246},{"$f":"IF(N168-N167=0,\"\",N168-N167)","v":9372},{"$f":"IF(M168=0,0,H168/M168)","v":0.52686982586354558},{"$f":"IF(M168=0,0,K168/M168)","v":0.29046531544390525},{"$f":"IF(M168=0,0,L168/M168)","v":0.18266485869254925},{"$f":"L168*100/B$1285","v":361766.78445229679}]
["2020-04-11T17:00:00",3,"Lombardia",12026,1174,13200,17058,30258,728,1544,16823,10511,57592,196302,{"$f":"IF(P169=\"x2\",M169,O168)","v":51534},{"$f":"IF(M169>O168*2,\"x2\",O168)","v":51534},{"$f":"IF(P169=\"x2\",M169,\"\")","v":""},null,{"$f":"M169*100/M1342","v":37.822040966434841},{"$f":"IF(J169-J168=0,\"\",J169-J168)","v":298},{"$f":"IF(K169-K168=0,\"\",K169-K168)","v":543},{"$f":"IF(L169-L168=0,\"\",L169-L168)","v":273},{"$f":"IF(M169-M168=0,\"\",M169-M168)","v":1544},{"$f":"IF(N169-N168=0,\"\",N169-N168)","v":9977},{"$f":"IF(M169=0,0,H169/M169)","v":0.52538547020419502},{"$f":"IF(M169=0,0,K169/M169)","v":0.29210654257535767},{"$f":"IF(M169=0,0,L169/M169)","v":0.18250798722044728},{"$f":"L169*100/B$1285","v":371413.42756183742}]
["2020-04-12T17:00:00",3,"Lombardia",11969,1176,13145,18120,31265,1007,1460,17166,10621,59052,205832,{"$f":"IF(P170=\"x2\",M170,O169)","v":51534},{"$f":"IF(M170>O169*2,\"x2\",O169)","v":51534},{"$f":"IF(P170=\"x2\",M170,\"\")","v":""},null,{"$f":"M170*100/M1343","v":37.765967652193936},{"$f":"IF(J170-J169=0,\"\",J170-J169)","v":-84},{"$f":"IF(K170-K169=0,\"\",K170-K169)","v":343},{"$f":"IF(L170-L169=0,\"\",L170-L169)","v":110},{"$f":"IF(M170-M169=0,\"\",M170-M169)","v":1460},{"$f":"IF(N170-N169=0,\"\",N170-N169)","v":9530},{"$f":"IF(M170=0,0,H170/M170)","v":0.52944862155388472},{"$f":"IF(M170=0,0,K170/M170)","v":0.29069294858768541},{"$f":"IF(M170=0,0,L170/M170)","v":0.17985842985842987},{"$f":"L170*100/B$1285","v":375300.35335689044}]
["2020-04-13T17:00:00",3,"Lombardia",12028,1143,13171,18764,31935,670,1262,17478,10901,60314,211092,{"$f":"IF(P171=\"x2\",M171,O170)","v":51534},{"$f":"IF(M171>O170*2,\"x2\",O170)","v":51534},{"$f":"IF(P171=\"x2\",M171,\"\")","v":""},null,{"$f":"M171*100/M1344","v":37.810627147120037},{"$f":"IF(J171-J170=0,\"\",J171-J170)","v":-198},{"$f":"IF(K171-K170=0,\"\",K171-K170)","v":312},{"$f":"IF(L171-L170=0,\"\",L171-L170)","v":280},{"$f":"IF(M171-M170=0,\"\",M171-M170)","v":1262},{"$f":"IF(N171-N170=0,\"\",N171-N170)","v":5260},{"$f":"IF(M171=0,0,H171/M171)","v":0.52947905958815533},{"$f":"IF(M171=0,0,K171/M171)","v":0.28978346652518489},{"$f":"IF(M171=0,0,L171/M171)","v":0.18073747388665981},{"$f":"L171*100/B$1285","v":385194.34628975263}]
["2020-04-14T17:00:00",3,"Lombardia",12077,1122,13199,19164,32363,428,1012,17821,11142,61326,214870,{"$f":"IF(P172=\"x2\",M172,O171)","v":51534},{"$f":"IF(M172>O171*2,\"x2\",O171)","v":51534},{"$f":"IF(P172=\"x2\",M172,\"\")","v":""},null,{"$f":"M172*100/M1345","v":37.74186401457338},{"$f":"IF(J172-J171=0,\"\",J172-J171)","v":-250},{"$f":"IF(K172-K171=0,\"\",K172-K171)","v":343},{"$f":"IF(L172-L171=0,\"\",L172-L171)","v":241},{"$f":"IF(M172-M171=0,\"\",M172-M171)","v":1012},{"$f":"IF(N172-N171=0,\"\",N172-N171)","v":3778},{"$f":"IF(M172=0,0,H172/M172)","v":0.5277207057365555},{"$f":"IF(M172=0,0,K172/M172)","v":0.29059452760656168},{"$f":"IF(M172=0,0,L172/M172)","v":0.18168476665688288},{"$f":"L172*100/B$1285","v":393710.2473498233}]
["2020-04-15T17:00:00",3,"Lombardia",12043,1074,13117,19804,32921,558,827,17855,11377,62153,221968,{"$f":"IF(P173=\"x2\",M173,O172)","v":51534},{"$f":"IF(M173>O172*2,\"x2\",O172)","v":51534},{"$f":"IF(P173=\"x2\",M173,\"\")","v":""},null,{"$f":"M173*100/M1346","v":37.633132511882778},{"$f":"IF(J173-J172=0,\"\",J173-J172)","v":-185},{"$f":"IF(K173-K172=0,\"\",K173-K172)","v":34},{"$f":"IF(L173-L172=0,\"\",L173-L172)","v":235},{"$f":"IF(M173-M172=0,\"\",M173-M172)","v":827},{"$f":"IF(N173-N172=0,\"\",N173-N172)","v":7098},{"$f":"IF(M173=0,0,H173/M173)","v":0.52967676540150921},{"$f":"IF(M173=0,0,K173/M173)","v":0.28727495052531654},{"$f":"IF(M173=0,0,L173/M173)","v":0.18304828407317425},{"$f":"L173*100/B$1285","v":402014.13427561836}]
[{"$f":"A173 + 1","v":"2020-04-16T17:00:00"},null,null,null,null,null,null,null,null,null,null,null,null,null,null,"Media x2",{"$f":"COUNT(M122:M173) / COUNT(Q122:Q173)","v":6.5}]
[{"$f":"A174+1","v":"2020-04-17T17:00:00"}]
[{"$f":"A175+1","v":"2020-04-18T17:00:00"}]
[null,null,null,null,{"$f":"E173/$M173","v":1.7279938216980678E-2},null,null,{"$f":"H173/$M173","v":0.52967676540150921},null,null,{"$f":"K173/$M173","v":0.28727495052531654},{"$f":"L173/$M173","v":0.18304828407317425},null,{"$f":"N173/$M173","v":3.57131594613293}]
[]
[]
[]
["Data","Codice","Regione","Ricoverati","Terap. Intens.","Ospedalizzati","Quarantena","Positivi","+ Positivi","Nuovi","Guariti","Deceduti","Totale","Tamponi",null,null,"x 2",null,"% su Tot.","+ Nuovi","+ Guariti","+ Deceduti","+ Totali","+ Tamponi","% Positivi","% Guariti","% Deceduti","P. Stimati"]
["2020-02-24T18:00:00",4,"P.A. Bolzano",0,0,0,0,0,0,0,0,0,0,1,{"$f":"M182","v":0},null,{"$f":"M182","v":0},null,{"$f":"M182*100/M1295","v":0},null,null,null,null,null,{"$f":"IF(M182=0,0,H182/M182)","v":0},{"$f":"IF(M182=0,0,K182/M182)","v":0},{"$f":"IF(M182=0,0,L182/M182)","v":0},{"$f":"L182*100/B$1285","v":0}]
["2020-02-25T18:00:00",4,"P.A. Bolzano",1,0,1,0,1,1,1,0,0,1,1,{"$f":"IF(P183=\"x2\",M183,O182)","v":1},{"$f":"IF(M183>O182*2,\"x2\",O182)","v":"x2"},{"$f":"IF(P183=\"x2\",M183,\"\")","v":1},null,{"$f":"M183*100/M1296","v":0.3105590062111801},{"$f":"IF(J183-J182=0,\"\",J183-J182)","v":1},{"$f":"IF(K183-K182=0,\"\",K183-K182)","v":""},{"$f":"IF(L183-L182=0,\"\",L183-L182)","v":""},{"$f":"IF(M183-M182=0,\"\",M183-M182)","v":1},{"$f":"IF(N183-N182=0,\"\",N183-N182)","v":""},1,0,0,{"$f":"L183*100/B$1285","v":0}]
["2020-02-26T18:00:00",4,"P.A. Bolzano",1,0,1,0,1,0,0,0,0,1,1,1,1,"",null,{"$f":"M184*100/M1297","v":0.25},-1,"","","","",1,0,0,{"$f":"L184*100/B$1285","v":0}]
["2020-02-27T18:00:00",4,"P.A. Bolzano",1,0,1,0,1,0,0,0,0,1,2,1,1,"",null,{"$f":"M185*100/M1298","v":0.15384615384615385},"","","","",1,1,0,0,{"$f":"L185*100/B$1285","v":0}]
["2020-02-28T18:00:00",4,"P.A. Bolzano",1,0,1,0,1,0,0,0,0,1,2,1,1,"",null,{"$f":"M186*100/M1299","v":0.11261261261261261},"","","","","",1,0,0,{"$f":"L186*100/B$1285","v":0}]
["2020-02-29T17:00:00",4,"P.A. Bolzano",1,0,1,0,1,0,0,0,0,1,16,1,1,"",null,{"$f":"M187*100/M1300","v":8.8652482269503549E-2},"","","","",14,1,0,0,{"$f":"L187*100/B$1285","v":0}]
["2020-03-01T17:00:00",4,"P.A. Bolzano",1,0,1,0,1,0,0,0,0,1,20,1,1,"",null,{"$f":"M188*100/M1301","v":5.9031877213695398E-2},"","","","",4,1,0,0,{"$f":"L188*100/B$1285","v":0}]
["2020-03-02T18:00:00",4,"P.A. Bolzano",1,0,1,0,1,0,0,0,0,1,20,1,1,"",null,{"$f":"M189*100/M1302","v":4.9115913555992138E-2},"","","","","",1,0,0,{"$f":"L189*100/B$1285","v":0}]
["2020-03-03T18:00:00",4,"P.A. Bolzano",1,0,1,0,1,0,0,0,0,1,20,1,1,"",null,{"$f":"M190*100/M1303","v":3.9968025579536368E-2},"","","","","",1,0,0,{"$f":"L190*100/B$1285","v":0}]
["2020-03-04T17:00:00",4,"P.A. Bolzano",1,0,1,0,1,0,0,0,0,1,20,1,1,"",null,{"$f":"M191*100/M1304","v":3.2372936225315639E-2},"","","","","",1,0,0,{"$f":"L191*100/B$1285","v":0}]
["2020-03-05T17:00:00",4,"P.A. Bolzano",1,0,1,0,1,0,0,0,0,1,20,1,1,"",null,{"$f":"M192*100/M1305","v":2.5920165889061691E-2},"","","","","",1,0,0,{"$f":"L192*100/B$1285","v":0}]
["2020-03-06T17:00:00",4,"P.A. Bolzano",4,0,4,0,4,3,3,0,0,4,36,4,"x2",4,null,{"$f":"M193*100/M1306","v":8.6281276962899056E-2},3,"","",3,16,1,0,0,{"$f":"L193*100/B$1285","v":0}]
["2020-03-07T18:00:00",4,"P.A. Bolzano",8,0,8,1,9,5,5,0,0,9,36,9,"x2",9,null,{"$f":"M194*100/M1307","v":0.15298317185109639},2,"","",5,"",1,0,0,{"$f":"L194*100/B$1285","v":0}]
["2020-03-08T18:00:00",4,"P.A. Bolzano",8,0,8,1,9,0,0,0,0,9,36,9,9,"",null,{"$f":"M195*100/M1308","v":0.12203389830508475},-5,"","","","",1,0,0,{"$f":"L195*100/B$1285","v":0}]
["2020-03-09T18:00:00",4,"P.A. Bolzano",8,0,8,1,9,0,0,0,0,9,36,9,9,"",null,{"$f":"M196*100/M1309","v":9.8124727431312689E-2},"","","","","",1,0,0,{"$f":"L196*100/B$1285","v":0}]
["2020-03-10T18:00:00",4,"P.A. Bolzano",17,1,18,20,38,29,29,0,0,38,36,38,"x2",38,null,{"$f":"M197*100/M1310","v":0.37442112523401322},29,"","",29,"",1,0,0,{"$f":"L197*100/B$1285","v":0}]
["2020-03-11T17:00:00",4,"P.A. Bolzano",8,4,12,63,75,37,37,0,0,75,75,38,38,"",null,{"$f":"M198*100/M1311","v":0.60182956186807901},8,"","",37,39,1,0,0,{"$f":"L198*100/B$1285","v":0}]
["2020-03-12T17:00:00",4,"P.A. Bolzano",21,4,25,78,103,28,28,0,1,104,607,104,"x2",104,null,{"$f":"M199*100/M1312","v":0.6881492754582148},-9,"",1,29,532,0.99038461538461542,0,9.6153846153846159E-3,{"$f":"L199*100/B$1285","v":35.335689045936398}]
["2020-03-13T17:00:00",4,"P.A. Bolzano",20,5,25,98,123,20,20,0,2,125,811,104,104,"",null,{"$f":"M200*100/M1313","v":0.70781426953567383},-8,"",1,21,204,0.98399999999999999,0,1.6E-2,{"$f":"L200*100/B$1285","v":70.671378091872796}]
["2020-03-14T17:00:00",4,"P.A. Bolzano",26,7,33,137,170,47,47,0,3,173,1135,104,104,"",null,{"$f":"M201*100/M1314","v":0.81769627073781725},27,"",1,48,324,0.98265895953757221,0,1.7341040462427744E-2,{"$f":"L201*100/B$1285","v":106.00706713780919}]
["2020-03-15T17:00:00",4,"P.A. Bolzano",50,4,54,145,199,29,29,0,5,204,1497,104,104,"",null,{"$f":"M202*100/M1315","v":0.82434234452660926},-18,"",2,31,362,0.97549019607843135,0,2.4509803921568627E-2,{"$f":"L202*100/B$1285","v":176.67844522968198}]
["2020-03-16T17:00:00",4,"P.A. Bolzano",53,11,64,171,235,36,36,0,6,241,1740,241,"x2",241,null,{"$f":"M203*100/M1316","v":0.8613295210864903},7,"",1,37,243,0.975103734439834,0,2.4896265560165973E-2,{"$f":"L203*100/B$1285","v":212.01413427561837}]
["2020-03-17T17:00:00",4,"P.A. Bolzano",71,11,82,200,282,47,47,1,8,291,2149,241,241,"",null,{"$f":"M204*100/M1317","v":0.92363359360121877},11,1,2,50,409,0.96907216494845361,3.4364261168384879E-3,2.7491408934707903E-2,{"$f":"L204*100/B$1285","v":282.68551236749119}]
["2020-03-18T17:00:00",4,"P.A. Bolzano",79,18,97,269,366,84,84,1,9,376,2844,241,241,"",null,{"$f":"M205*100/M1318","v":1.0528379021644778},37,"",1,85,695,0.97340425531914898,2.6595744680851063E-3,2.3936170212765957E-2,{"$f":"L205*100/B$1285","v":318.02120141342755}]
["2020-03-19T17:00:00",4,"P.A. Bolzano",87,18,105,316,421,55,55,1,14,436,3568,241,241,"",null,{"$f":"M206*100/M1319","v":1.0625076154502253},-29,"",5,60,724,0.9655963302752294,2.2935779816513763E-3,3.2110091743119268E-2,{"$f":"L206*100/B$1285","v":494.69964664310953}]
["2020-03-20T17:00:00",4,"P.A. Bolzano",99,24,123,407,530,109,109,1,17,548,4433,548,"x2",548,null,{"$f":"M207*100/M1320","v":1.1654367197635098},54,"",3,112,{"$f":"IF(N207-N206=0,\"\",N207-N206)","v":865},0.96715328467153283,1.8248175182481751E-3,3.1021897810218978E-2,{"$f":"L207*100/B$1285","v":600.70671378091868}]
["2020-03-21T17:00:00",4,"P.A. Bolzano",127,30,157,443,600,70,70,1,20,621,5179,548,548,"",null,{"$f":"M208*100/M1321","v":1.1590578222404719},-39,"",3,{"$f":"IF(M208-M207=0,\"\",M208-M207)","v":73},746,0.96618357487922701,1.6103059581320451E-3,3.2206119162640899E-2,{"$f":"L208*100/B$1285","v":706.71378091872793}]
["2020-03-22T17:00:00",4,"P.A. Bolzano",146,32,178,470,648,48,48,7,23,678,5718,548,548,"",null,{"$f":"M209*100/M1322","v":1.1464709662146166},-22,6,3,57,539,0.95575221238938057,1.0324483775811209E-2,3.3923303834808259E-2,{"$f":"L209*100/B$1285","v":812.72084805653708}]
["2020-03-23T17:00:00",4,"P.A. Bolzano",145,33,178,510,688,40,40,7,29,724,6084,548,548,"",null,{"$f":"M210*100/M1323","v":1.132541805496895},-8,"",6,46,366,0.95027624309392267,9.6685082872928173E-3,4.0055248618784532E-2,{"$f":"L210*100/B$1285","v":1024.7349823321554}]
["2020-03-24T17:00:00",4,"P.A. Bolzano",166,38,204,495,699,11,11,44,38,781,6509,548,548,"",null,{"$f":"M211*100/M1324","v":1.1290042789406731},-29,37,9,57,425,0.89500640204865556,5.6338028169014086E-2,4.8655569782330349E-2,{"$f":"L211*100/B$1285","v":1342.756183745583}]
["2020-03-25T17:00:00",4,"P.A. Bolzano",190,40,230,518,748,49,49,67,43,858,6649,548,548,"",null,{"$f":"M212*100/M1325","v":1.1534428521495981},38,23,5,77,140,0.87179487179487181,7.8088578088578095E-2,5.011655011655012E-2,{"$f":"L212*100/B$1285","v":1519.434628975265}]
["2020-03-26T17:00:00",4,"P.A. Bolzano",223,43,266,525,791,43,43,67,48,906,7744,548,548,"",null,{"$f":"M213*100/M1326","v":1.124920845801413},-6,"",5,48,{"$f":"IF(N213-N212=0,\"\",N213-N212)","v":1095},0.8730684326710817,7.3951434878587199E-2,5.2980132450331126E-2,{"$f":"L213*100/B$1285","v":1696.113074204947}]
["2020-03-27T17:00:00",4,"P.A. Bolzano",249,45,294,539,833,42,97,110,60,1003,8520,{"$f":"IF(P214=\"x2\",M214,O213)","v":548},{"$f":"IF(M214>O213*2,\"x2\",O213)","v":548},{"$f":"IF(P214=\"x2\",M214,\"\")","v":""},null,{"$f":"M214*100/M1327","v":1.1595643829915143},{"$f":"IF(J214-J213=0,\"\",J214-J213)","v":54},43,12,97,776,0.83050847457627119,0.10967098703888335,5.9820538384845461E-2,{"$f":"L214*100/B$1285","v":2120.1413427561838}]
["2020-03-28T17:00:00",4,"P.A. Bolzano",225,51,276,653,929,96,106,116,64,1109,9168,1109,"x2",1109,null,{"$f":"M215*100/M1328","v":1.1992819448049139},9,6,4,106,648,0.83769161406672676,0.10459873760144274,5.7709648331830475E-2,{"$f":"L215*100/B$1285","v":2261.4840989399295}]
["2020-03-29T17:00:00",4,"P.A. Bolzano",234,56,290,744,1034,105,105,116,64,1214,10137,1109,1109,"",null,{"$f":"M216*100/M1329","v":1.2427192416751118},-1,"","",105,969,0.8517298187808896,9.5551894563426693E-2,5.2718286655683691E-2,{"$f":"L216*100/B$1285","v":2261.4840989399295}]
["2020-03-30T17:00:00",4,"P.A. Bolzano",231,62,293,805,1098,64,111,153,74,1325,10640,1109,1109,"",null,{"$f":"M217*100/M1330","v":1.302352097032603},6,37,10,111,503,0.82867924528301884,0.11547169811320755,5.5849056603773588E-2,{"$f":"L217*100/B$1285","v":2614.840989399293}]
["2020-03-31T17:00:00",4,"P.A. Bolzano",249,62,311,831,1142,44,46,153,76,1371,11275,1109,1109,"",null,{"$f":"M218*100/M1331","v":1.2959392014519056},-65,"",2,46,635,0.83296863603209337,0.11159737417943107,5.5433989788475566E-2,{"$f":"L218*100/B$1285","v":2685.5123674911661}]
["2020-04-01T17:00:00",4,"P.A. Bolzano",269,57,326,786,1112,-30,47,190,116,1418,11951,1109,1109,"",null,{"$f":"M219*100/M1332","v":1.2823991173331886},1,37,40,47,{"$f":"IF(N219-N218=0,\"\",N219-N218)","v":676},{"$f":"IF(M219=0,0,H219/M219)","v":0.7842031029619182},{"$f":"IF(M219=0,0,K219/M219)","v":0.13399153737658676},{"$f":"IF(M219=0,0,L219/M219)","v":8.1805359661495061E-2},{"$f":"L219*100/B$1285","v":4098.9399293286215}]
["2020-04-02T17:00:00",4,"P.A. Bolzano",279,60,339,821,1160,48,61,190,129,1479,12677,{"$f":"IF(P220=\"x2\",M220,O219)","v":1109},{"$f":"IF(M220>O219*2,\"x2\",O219)","v":1109},{"$f":"IF(P220=\"x2\",M220,\"\")","v":""},null,{"$f":"M220*100/M1333","v":1.2833862654240642},{"$f":"IF(J220-J219=0,\"\",J220-J219)","v":14},{"$f":"IF(K220-K219=0,\"\",K220-K219)","v":""},{"$f":"IF(L220-L219=0,\"\",L220-L219)","v":13},{"$f":"IF(M220-M219=0,\"\",M220-M219)","v":61},726,0.78431372549019607,0.12846517917511832,8.7221095334685597E-2,{"$f":"L220*100/B$1285","v":4558.3038869257953}]
["2020-04-03T17:00:00",4,"P.A. Bolzano",291,60,351,858,1209,49,80,211,139,1559,13976,{"$f":"IF(P221=\"x2\",M221,O220)","v":1109},{"$f":"IF(M221>O220*2,\"x2\",O220)","v":1109},{"$f":"IF(P221=\"x2\",M221,\"\")","v":""},null,{"$f":"M221*100/M1334","v":1.3010423360344496},{"$f":"IF(J221-J220=0,\"\",J221-J220)","v":19},{"$f":"IF(K221-K220=0,\"\",K221-K220)","v":21},{"$f":"IF(L221-L220=0,\"\",L221-L220)","v":10},{"$f":"IF(M221-M220=0,\"\",M221-M220)","v":80},1299,0.77549711353431683,0.13534316869788326,8.9159717767799865E-2,{"$f":"L221*100/B$1285","v":4911.6607773851592}]
["2020-04-04T17:00:00",4,"P.A. Bolzano",291,61,352,849,1201,-8,33,245,146,1592,15045,{"$f":"IF(P222=\"x2\",M222,O221)","v":1109},{"$f":"IF(M222>O221*2,\"x2\",O221)","v":1109},{"$f":"IF(P222=\"x2\",M222,\"\")","v":""},null,{"$f":"M222*100/M1335","v":1.2773605494576032},{"$f":"IF(J222-J221=0,\"\",J222-J221)","v":-47},{"$f":"IF(K222-K221=0,\"\",K222-K221)","v":34},{"$f":"IF(L222-L221=0,\"\",L222-L221)","v":7},{"$f":"IF(M222-M221=0,\"\",M222-M221)","v":33},1069,0.75439698492462315,0.15389447236180903,9.1708542713567834E-2,{"$f":"L222*100/B$1285","v":5159.0106007067134}]
["2020-04-05T17:00:00",4,"P.A. Bolzano",239,53,292,934,1226,25,52,260,158,1644,15723,{"$f":"IF(P223=\"x2\",M223,O222)","v":1109},{"$f":"IF(M223>O222*2,\"x2\",O222)","v":1109},{"$f":"IF(P223=\"x2\",M223,\"\")","v":""},null,{"$f":"M223*100/M1336","v":1.2749325309427055},{"$f":"IF(J223-J222=0,\"\",J223-J222)","v":19},{"$f":"IF(K223-K222=0,\"\",K223-K222)","v":15},{"$f":"IF(L223-L222=0,\"\",L223-L222)","v":12},{"$f":"IF(M223-M222=0,\"\",M223-M222)","v":52},678,0.74574209245742096,0.15815085158150852,9.6107055961070553E-2,{"$f":"L223*100/B$1285","v":5583.03886925795}]
["2020-04-06T17:00:00",4,"P.A. Bolzano",245,52,297,963,1260,34,78,298,164,1722,16825,{"$f":"IF(P224=\"x2\",M224,O223)","v":1109},{"$f":"IF(M224>O223*2,\"x2\",O223)","v":1109},{"$f":"IF(P224=\"x2\",M224,\"\")","v":""},null,{"$f":"M224*100/M1337","v":1.2991618067553397},{"$f":"IF(J224-J223=0,\"\",J224-J223)","v":26},{"$f":"IF(K224-K223=0,\"\",K224-K223)","v":38},{"$f":"IF(L224-L223=0,\"\",L224-L223)","v":6},{"$f":"IF(M224-M223=0,\"\",M224-M223)","v":78},1102,0.73170731707317072,0.17305458768873402,9.5238095238095233E-2,{"$f":"L224*100/B$1285","v":5795.0530035335687}]
["2020-04-07T17:00:00",4,"P.A. Bolzano",325,64,389,912,1301,41,89,336,174,1811,17761,{"$f":"IF(P225=\"x2\",M225,O224)","v":1109},{"$f":"IF(M225>O224*2,\"x2\",O224)","v":1109},{"$f":"IF(P225=\"x2\",M225,\"\")","v":""},null,{"$f":"M225*100/M1338","v":1.3356836251530393},{"$f":"IF(J225-J224=0,\"\",J225-J224)","v":11},{"$f":"IF(K225-K224=0,\"\",K225-K224)","v":38},{"$f":"IF(L225-L224=0,\"\",L225-L224)","v":10},{"$f":"IF(M225-M224=0,\"\",M225-M224)","v":89},{"$f":"IF(N225-N224=0,\"\",N225-N224)","v":936},{"$f":"IF(M225=0,0,H225/M225)","v":0.71838763114301496},{"$f":"IF(M225=0,0,K225/M225)","v":0.18553285477636663},{"$f":"IF(M225=0,0,L225/M225)","v":9.6079514080618447E-2},{"$f":"L225*100/B$1285","v":6148.4098939929327}]
["2020-04-08T17:00:00",4,"P.A. Bolzano",268,65,333,948,1281,-20,24,371,183,1835,18865,{"$f":"IF(P226=\"x2\",M226,O225)","v":1109},{"$f":"IF(M226>O225*2,\"x2\",O225)","v":1109},{"$f":"IF(P226=\"x2\",M226,\"\")","v":""},null,{"$f":"M226*100/M1339","v":1.3161480971439228},{"$f":"IF(J226-J225=0,\"\",J226-J225)","v":-65},{"$f":"IF(K226-K225=0,\"\",K226-K225)","v":35},{"$f":"IF(L226-L225=0,\"\",L226-L225)","v":9},{"$f":"IF(M226-M225=0,\"\",M226-M225)","v":24},{"$f":"IF(N226-N225=0,\"\",N226-N225)","v":1104},{"$f":"IF(M226=0,0,H226/M226)","v":0.6980926430517711},{"$f":"IF(M226=0,0,K226/M226)","v":0.20217983651226157},{"$f":"IF(M226=0,0,L226/M226)","v":9.9727520435967304E-2},{"$f":"L226*100/B$1285","v":6466.4310954063603}]
["2020-04-09T17:00:00",4,"P.A. Bolzano",263,64,327,988,1315,34,68,401,187,1903,19875,{"$f":"IF(P227=\"x2\",M227,O226)","v":1109},{"$f":"IF(M227>O226*2,\"x2\",O226)","v":1109},{"$f":"IF(P227=\"x2\",M227,\"\")","v":""},null,{"$f":"M227*100/M1340","v":1.3249690167518415},{"$f":"IF(J227-J226=0,\"\",J227-J226)","v":44},{"$f":"IF(K227-K226=0,\"\",K227-K226)","v":30},{"$f":"IF(L227-L226=0,\"\",L227-L226)","v":4},{"$f":"IF(M227-M226=0,\"\",M227-M226)","v":68},{"$f":"IF(N227-N226=0,\"\",N227-N226)","v":1010},{"$f":"IF(M227=0,0,H227/M227)","v":0.69101418812401472},{"$f":"IF(M227=0,0,K227/M227)","v":0.21071991592222805},{"$f":"IF(M227=0,0,L227/M227)","v":9.8265895953757232E-2},{"$f":"L227*100/B$1285","v":6607.7738515901056}]
["2020-04-10T17:00:00",4,"P.A. Bolzano",258,58,316,1001,1317,2,52,447,191,1955,20866,{"$f":"IF(P228=\"x2\",M228,O227)","v":1109},{"$f":"IF(M228>O227*2,\"x2\",O227)","v":1109},{"$f":"IF(P228=\"x2\",M228,\"\")","v":""},null,{"$f":"M228*100/M1341","v":1.324732173712706},{"$f":"IF(J228-J227=0,\"\",J228-J227)","v":-16},{"$f":"IF(K228-K227=0,\"\",K228-K227)","v":46},{"$f":"IF(L228-L227=0,\"\",L228-L227)","v":4},{"$f":"IF(M228-M227=0,\"\",M228-M227)","v":52},{"$f":"IF(N228-N227=0,\"\",N228-N227)","v":991},{"$f":"IF(M228=0,0,H228/M228)","v":0.6736572890025575},{"$f":"IF(M228=0,0,K228/M228)","v":0.22864450127877237},{"$f":"IF(M228=0,0,L228/M228)","v":9.7698209718670076E-2},{"$f":"L228*100/B$1285","v":6749.1166077738517}]
["2020-04-11T17:00:00",4,"P.A. Bolzano",246,56,302,967,1269,-48,2,488,200,1957,22186,{"$f":"IF(P229=\"x2\",M229,O228)","v":1109},{"$f":"IF(M229>O228*2,\"x2\",O228)","v":1109},{"$f":"IF(P229=\"x2\",M229,\"\")","v":""},null,{"$f":"M229*100/M1342","v":1.2852086083364527},{"$f":"IF(J229-J228=0,\"\",J229-J228)","v":-50},{"$f":"IF(K229-K228=0,\"\",K229-K228)","v":41},{"$f":"IF(L229-L228=0,\"\",L229-L228)","v":9},{"$f":"IF(M229-M228=0,\"\",M229-M228)","v":2},{"$f":"IF(N229-N228=0,\"\",N229-N228)","v":1320},{"$f":"IF(M229=0,0,H229/M229)","v":0.6484414920797138},{"$f":"IF(M229=0,0,K229/M229)","v":0.24936126724578436},{"$f":"IF(M229=0,0,L229/M229)","v":0.10219724067450178},{"$f":"L229*100/B$1285","v":7067.1378091872793}]
["2020-04-12T17:00:00",4,"P.A. Bolzano",183,45,228,1287,1515,246,141,378,205,2098,23246,{"$f":"IF(P230=\"x2\",M230,O229)","v":1109},{"$f":"IF(M230>O229*2,\"x2\",O229)","v":1109},{"$f":"IF(P230=\"x2\",M230,\"\")","v":""},null,{"$f":"M230*100/M1343","v":1.3417496466555388},{"$f":"IF(J230-J229=0,\"\",J230-J229)","v":139},{"$f":"IF(K230-K229=0,\"\",K230-K229)","v":-110},{"$f":"IF(L230-L229=0,\"\",L230-L229)","v":5},{"$f":"IF(M230-M229=0,\"\",M230-M229)","v":141},{"$f":"IF(N230-N229=0,\"\",N230-N229)","v":1060},{"$f":"IF(M230=0,0,H230/M230)","v":0.7221163012392755},{"$f":"IF(M230=0,0,K230/M230)","v":0.1801715919923737},{"$f":"IF(M230=0,0,L230/M230)","v":9.7712106768350807E-2},{"$f":"L230*100/B$1285","v":7243.8162544169609}]
["2020-04-13T17:00:00",4,"P.A. Bolzano",190,41,231,1306,1537,22,51,400,212,2149,24157,{"$f":"IF(P231=\"x2\",M231,O230)","v":1109},{"$f":"IF(M231>O230*2,\"x2\",O230)","v":1109},{"$f":"IF(P231=\"x2\",M231,\"\")","v":""},null,{"$f":"M231*100/M1344","v":1.34720028084957},{"$f":"IF(J231-J230=0,\"\",J231-J230)","v":-90},{"$f":"IF(K231-K230=0,\"\",K231-K230)","v":22},{"$f":"IF(L231-L230=0,\"\",L231-L230)","v":7},{"$f":"IF(M231-M230=0,\"\",M231-M230)","v":51},{"$f":"IF(N231-N230=0,\"\",N231-N230)","v":911},{"$f":"IF(M231=0,0,H231/M231)","v":0.71521637971149377},{"$f":"IF(M231=0,0,K231/M231)","v":0.18613308515588645},{"$f":"IF(M231=0,0,L231/M231)","v":9.8650535132619829E-2},{"$f":"L231*100/B$1285","v":7491.1660777385159}]
["2020-04-14T17:00:00",4,"P.A. Bolzano",177,39,216,1348,1564,27,35,406,214,2184,24457,{"$f":"IF(P232=\"x2\",M232,O231)","v":1109},{"$f":"IF(M232>O231*2,\"x2\",O231)","v":1109},{"$f":"IF(P232=\"x2\",M232,\"\")","v":""},null,{"$f":"M232*100/M1345","v":1.3440992565604846},{"$f":"IF(J232-J231=0,\"\",J232-J231)","v":-16},{"$f":"IF(K232-K231=0,\"\",K232-K231)","v":6},{"$f":"IF(L232-L231=0,\"\",L232-L231)","v":2},{"$f":"IF(M232-M231=0,\"\",M232-M231)","v":35},{"$f":"IF(N232-N231=0,\"\",N232-N231)","v":300},{"$f":"IF(M232=0,0,H232/M232)","v":0.71611721611721613},{"$f":"IF(M232=0,0,K232/M232)","v":0.1858974358974359},{"$f":"IF(M232=0,0,L232/M232)","v":9.7985347985347984E-2},{"$f":"L232*100/B$1285","v":7561.8374558303885}]
["2020-04-15T17:00:00",4,"P.A. Bolzano",166,32,198,1378,1576,12,40,425,223,2224,25370,{"$f":"IF(P233=\"x2\",M233,O232)","v":2224},{"$f":"IF(M233>O232*2,\"x2\",O232)","v":"x2"},{"$f":"IF(P233=\"x2\",M233,\"\")","v":2224},null,{"$f":"M233*100/M1346","v":1.3466137870485302},{"$f":"IF(J233-J232=0,\"\",J233-J232)","v":5},{"$f":"IF(K233-K232=0,\"\",K233-K232)","v":19},{"$f":"IF(L233-L232=0,\"\",L233-L232)","v":9},{"$f":"IF(M233-M232=0,\"\",M233-M232)","v":40},{"$f":"IF(N233-N232=0,\"\",N233-N232)","v":913},{"$f":"IF(M233=0,0,H233/M233)","v":0.70863309352517989},{"$f":"IF(M233=0,0,K233/M233)","v":0.19109712230215828},{"$f":"IF(M233=0,0,L233/M233)","v":0.10026978417266187},{"$f":"L233*100/B$1285","v":7879.8586572438162}]
[{"$f":"A233 + 1","v":"2020-04-16T17:00:00"},null,null,null,null,null,null,null,null,null,null,null,null,null,null,"Media x2",{"$f":"COUNT(M182:M233) / COUNT(Q182:Q233)","v":5.2}]
[{"$f":"A234+1","v":"2020-04-17T17:00:00"}]
[{"$f":"A235+1","v":"2020-04-18T17:00:00"}]
[null,null,null,null,{"$f":"E233/$M233","v":1.4388489208633094E-2},null,null,{"$f":"H233/$M233","v":0.70863309352517989},null,null,{"$f":"K233/$M233","v":0.19109712230215828},{"$f":"L233/$M233","v":0.10026978417266187},null,{"$f":"N233/$M233","v":11.407374100719425}]
[]
[]
[]
["Data","Codice","Regione","Ricoverati","Terap. Intens.","Ospedalizzati","Quarantena","Positivi","+ Positivi","Nuovi","Guariti","Deceduti","Totale","Tamponi",null,null,"x 2",null,"% su Tot.","+ Nuovi","+ Guariti","+ Deceduti","+ Totali","+ Tamponi","% Positivi","% Guariti","% Deceduti","P. Stimati"]
["2020-02-24T18:00:00",4,"P.A. Trento",0,0,0,0,0,0,0,0,0,0,3,{"$f":"M242","v":0},null,{"$f":"M242","v":0},null,{"$f":"M242*100/M1295","v":0},null,null,null,null,null,{"$f":"IF(M242=0,0,H242/M242)","v":0},{"$f":"IF(M242=0,0,K242/M242)","v":0},{"$f":"IF(M242=0,0,L242/M242)","v":0},{"$f":"L242*100/B$1285","v":0}]
["2020-02-25T18:00:00",4,"P.A. Trento",0,0,0,0,0,0,0,0,0,0,3,{"$f":"IF(P243=\"x2\",M243,O242)","v":0},{"$f":"IF(M243>O242*2,\"x2\",O242)","v":0},{"$f":"IF(P243=\"x2\",M243,\"\")","v":""},null,{"$f":"M243*100/M1296","v":0},{"$f":"IF(J243-J242=0,\"\",J243-J242)","v":""},{"$f":"IF(K243-K242=0,\"\",K243-K242)","v":""},{"$f":"IF(L243-L242=0,\"\",L243-L242)","v":""},{"$f":"IF(M243-M242=0,\"\",M243-M242)","v":""},{"$f":"IF(N243-N242=0,\"\",N243-N242)","v":""},0,0,0,{"$f":"L243*100/B$1285","v":0}]
["2020-02-26T18:00:00",4,"P.A. Trento",0,0,0,0,0,0,0,0,0,0,3,0,0,"",null,{"$f":"M244*100/M1297","v":0},"","","","","",0,0,0,{"$f":"L244*100/B$1285","v":0}]
["2020-02-27T18:00:00",4,"P.A. Trento",0,0,0,0,0,0,0,0,0,0,32,0,0,"",null,{"$f":"M245*100/M1298","v":0},"","","","",29,0,0,0,{"$f":"L245*100/B$1285","v":0}]
["2020-02-28T18:00:00",4,"P.A. Trento",0,0,0,0,0,0,0,0,0,0,32,0,0,"",null,{"$f":"M246*100/M1299","v":0},"","","","","",0,0,0,{"$f":"L246*100/B$1285","v":0}]
["2020-02-29T17:00:00",4,"P.A. Trento",0,0,0,0,0,0,0,0,0,0,43,0,0,"",null,{"$f":"M247*100/M1300","v":0},"","","","",11,0,0,0,{"$f":"L247*100/B$1285","v":0}]
["2020-03-01T17:00:00",4,"P.A. Trento",0,0,0,0,0,0,0,0,0,0,122,0,0,"",null,{"$f":"M248*100/M1301","v":0},"","","","",79,0,0,0,{"$f":"L248*100/B$1285","v":0}]
["2020-03-02T18:00:00",4,"P.A. Trento",0,0,0,0,0,0,0,0,0,0,122,0,0,"",null,{"$f":"M249*100/M1302","v":0},"","","","","",0,0,0,{"$f":"L249*100/B$1285","v":0}]
["2020-03-03T18:00:00",4,"P.A. Trento",1,0,1,3,4,4,4,0,0,4,122,4,"x2",4,null,{"$f":"M250*100/M1303","v":0.15987210231814547},4,"","",4,"",1,0,0,{"$f":"L250*100/B$1285","v":0}]
["2020-03-04T17:00:00",4,"P.A. Trento",1,0,1,4,5,1,1,0,0,5,122,4,4,"",null,{"$f":"M251*100/M1304","v":0.16186468112657817},-3,"","",1,"",1,0,0,{"$f":"L251*100/B$1285","v":0}]
["2020-03-05T17:00:00",4,"P.A. Trento",2,0,2,5,7,2,2,0,0,7,122,4,4,"",null,{"$f":"M252*100/M1305","v":0.18144116122343182},1,"","",2,"",1,0,0,{"$f":"L252*100/B$1285","v":0}]
["2020-03-06T17:00:00",4,"P.A. Trento",4,0,4,6,10,3,3,0,0,10,122,10,"x2",10,null,{"$f":"M253*100/M1306","v":0.21570319240724764},1,"","",3,"",1,0,0,{"$f":"L253*100/B$1285","v":0}]
["2020-03-07T18:00:00",4,"P.A. Trento",6,1,7,7,14,4,4,0,0,14,194,10,10,"",null,{"$f":"M254*100/M1307","v":0.23797382287948327},1,"","",4,72,1,0,0,{"$f":"L254*100/B$1285","v":0}]
["2020-03-08T18:00:00",4,"P.A. Trento",7,2,9,14,23,9,9,0,0,23,228,23,"x2",23,null,{"$f":"M255*100/M1308","v":0.31186440677966104},5,"","",9,34,1,0,0,{"$f":"L255*100/B$1285","v":0}]
["2020-03-09T18:00:00",4,"P.A. Trento",10,2,12,21,33,10,10,0,0,33,267,23,23,"",null,{"$f":"M256*100/M1309","v":0.35979066724814651},1,"","",10,39,1,0,0,{"$f":"L256*100/B$1285","v":0}]
["2020-03-10T18:00:00",4,"P.A. Trento",19,3,22,28,50,17,17,2,0,52,399,52,"x2",52,null,{"$f":"M257*100/M1310","v":0.51236575032022857},7,2,"",19,132,0.96153846153846156,3.8461538461538464E-2,0,{"$f":"L257*100/B$1285","v":0}]
["2020-03-11T17:00:00",4,"P.A. Trento",28,4,32,42,74,24,24,3,0,77,527,52,52,"",null,{"$f":"M258*100/M1311","v":0.61787835018456105},7,1,"",25,128,0.96103896103896103,3.896103896103896E-2,0,{"$f":"L258*100/B$1285","v":0}]
["2020-03-12T17:00:00",4,"P.A. Trento",43,5,48,54,102,28,28,4,1,107,593,107,"x2",107,null,{"$f":"M259*100/M1312","v":0.70799973532720173},4,1,1,30,66,0.95327102803738317,3.7383177570093455E-2,9.3457943925233638E-3,{"$f":"L259*100/B$1285","v":35.335689045936398}]
["2020-03-13T17:00:00",4,"P.A. Trento",58,6,64,93,157,55,55,4,2,163,846,107,107,"",null,{"$f":"M260*100/M1313","v":0.92298980747451864},27,"",1,56,253,0.96319018404907975,2.4539877300613498E-2,1.2269938650306749E-2,{"$f":"L260*100/B$1285","v":70.671378091872796}]
["2020-03-14T17:00:00",4,"P.A. Trento",68,12,80,119,199,42,42,5,2,206,1006,107,107,"",null,{"$f":"M261*100/M1314","v":0.97367301602306566},-13,1,"",43,160,0.96601941747572817,2.4271844660194174E-2,9.7087378640776691E-3,{"$f":"L261*100/B$1285","v":70.671378091872796}]
["2020-03-15T17:00:00",4,"P.A. Trento",73,19,92,275,367,168,168,5,6,378,1006,378,"x2",378,null,{"$f":"M262*100/M1315","v":1.5274578736816584},126,"",4,172,"",0.97089947089947093,1.3227513227513227E-2,1.5873015873015872E-2,{"$f":"L262*100/B$1285","v":212.01413427561837}]
["2020-03-16T17:00:00",4,"P.A. Trento",73,19,92,275,367,0,0,5,6,378,1006,378,378,"",null,{"$f":"M263*100/M1316","v":1.3509649749821302},-168,"","","","",0.97089947089947093,1.3227513227513227E-2,1.5873015873015872E-2,{"$f":"L263*100/B$1285","v":212.01413427561837}]
["2020-03-17T17:00:00",4,"P.A. Trento",107,22,129,239,368,1,1,10,7,385,1727,378,378,"",null,{"$f":"M264*100/M1317","v":1.2219894623246366},1,5,1,7,721,0.95584415584415583,2.5974025974025976E-2,1.8181818181818181E-2,{"$f":"L264*100/B$1285","v":247.34982332155477}]
["2020-03-18T17:00:00",4,"P.A. Trento",141,22,163,273,436,68,68,12,7,455,2187,378,378,"",null,{"$f":"M265*100/M1318","v":1.2740458656511635},67,2,"",70,460,0.95824175824175828,2.6373626373626374E-2,1.5384615384615385E-2,{"$f":"L265*100/B$1285","v":247.34982332155477}]
["2020-03-19T17:00:00",4,"P.A. Trento",169,30,199,292,491,55,55,20,12,523,2203,378,378,"",null,{"$f":"M266*100/M1319","v":1.2745217497258439},-13,8,5,68,16,0.93881453154875716,3.8240917782026769E-2,2.2944550669216062E-2,{"$f":"L266*100/B$1285","v":424.02826855123675}]
["2020-03-20T17:00:00",4,"P.A. Trento",198,34,232,368,600,109,109,29,13,642,2656,378,378,"",null,{"$f":"M267*100/M1320","v":1.3653473979711193},54,9,1,119,{"$f":"IF(N267-N266=0,\"\",N267-N266)","v":453},0.93457943925233644,4.5171339563862926E-2,2.0249221183800622E-2,{"$f":"L267*100/B$1285","v":459.36395759717311}]
["2020-03-21T17:00:00",4,"P.A. Trento",233,39,272,448,720,120,120,34,28,782,2656,782,"x2",782,null,{"$f":"M268*100/M1321","v":1.4595542946731868},11,5,15,{"$f":"IF(M268-M267=0,\"\",M268-M267)","v":140},"",0.92071611253196928,4.3478260869565216E-2,3.5805626598465472E-2,{"$f":"L268*100/B$1285","v":989.39929328621906}]
["2020-03-22T17:00:00",4,"P.A. Trento",235,46,281,604,885,165,165,34,35,954,3050,782,782,"",null,{"$f":"M269*100/M1322","v":1.6131759613108323},45,"",7,172,394,0.92767295597484278,3.5639412997903561E-2,3.668763102725367E-2,{"$f":"L269*100/B$1285","v":1236.7491166077739}]
["2020-03-23T17:00:00",4,"P.A. Trento",249,46,295,619,914,29,29,68,41,1023,3150,782,782,"",null,{"$f":"M270*100/M1323","v":1.6002627997559717},-136,34,6,69,100,0.89345063538611924,6.647116324535679E-2,4.0078201368523948E-2,{"$f":"L270*100/B$1285","v":1448.7632508833922}]
["2020-03-24T17:00:00",4,"P.A. Trento",308,49,357,618,975,61,61,79,56,1110,3712,782,782,"",null,{"$f":"M271*100/M1324","v":1.6046027523996762},32,11,15,87,562,0.8783783783783784,7.1171171171171166E-2,5.0450450450450449E-2,{"$f":"L271*100/B$1285","v":1978.7985865724381}]
["2020-03-25T17:00:00",4,"P.A. Trento",308,65,373,685,1058,83,83,90,74,1222,4114,782,782,"",null,{"$f":"M272*100/M1325","v":1.6427822439706397},22,11,18,112,402,0.86579378068739776,7.3649754500818329E-2,6.0556464811783964E-2,{"$f":"L272*100/B$1285","v":2614.840989399293}]
["2020-03-26T17:00:00",4,"P.A. Trento",300,66,366,728,1094,36,36,117,86,1297,4600,782,782,"",null,{"$f":"M273*100/M1326","v":1.6103999304684686},-47,27,12,75,{"$f":"IF(N273-N272=0,\"\",N273-N272)","v":486},0.84348496530454897,9.0208172706245177E-2,6.6306861989205865E-2,{"$f":"L273*100/B$1285","v":3038.86925795053}]
["2020-03-27T17:00:00",4,"P.A. Trento",341,66,407,757,1164,70,94,125,102,1391,4923,{"$f":"IF(P274=\"x2\",M274,O273)","v":782},{"$f":"IF(M274>O273*2,\"x2\",O273)","v":782},{"$f":"IF(P274=\"x2\",M274,\"\")","v":""},null,{"$f":"M274*100/M1327","v":1.6081296677379824},{"$f":"IF(J274-J273=0,\"\",J274-J273)","v":58},8,16,94,323,0.83680805176132278,8.986340762041696E-2,7.3328540618260246E-2,{"$f":"L274*100/B$1285","v":3604.2402826855123}]
["2020-03-28T17:00:00",4,"P.A. Trento",351,72,423,811,1234,70,114,151,120,1505,5561,782,782,"",null,{"$f":"M275*100/M1328","v":1.6275196816333592},20,26,18,114,638,0.8199335548172757,0.10033222591362126,7.9734219269102985E-2,{"$f":"L275*100/B$1285","v":4240.2826855123676}]
["2020-03-29T17:00:00",4,"P.A. Trento",356,75,431,862,1293,59,89,172,129,1594,5950,1594,"x2",1594,null,{"$f":"M276*100/M1329","v":1.6317087901401386},-25,21,9,89,389,0.81116687578419067,0.10790464240903387,8.0928481806775407E-2,{"$f":"L276*100/B$1285","v":4558.3038869257953}]
["2020-03-30T17:00:00",4,"P.A. Trento",353,78,431,926,1357,64,88,178,147,1682,6377,1594,1594,"",null,{"$f":"M277*100/M1330","v":1.6532499827991232},-1,6,18,88,427,0.80677764565992871,0.10582639714625446,8.7395957193816889E-2,{"$f":"L277*100/B$1285","v":5194.3462897526497}]
["2020-03-31T17:00:00",4,"P.A. Trento",354,80,434,955,1389,32,64,193,164,1746,6973,1594,1594,"",null,{"$f":"M278*100/M1331","v":1.6504083484573502},-24,15,17,64,596,0.79553264604810991,0.11053837342497136,9.3928980526918671E-2,{"$f":"L278*100/B$1285","v":5795.0530035335687}]
["2020-04-01T17:00:00",4,"P.A. Trento",345,76,421,1062,1483,94,124,214,173,1870,7675,1594,1594,"",null,{"$f":"M279*100/M1332","v":1.6911751406298046},60,21,9,124,{"$f":"IF(N279-N278=0,\"\",N279-N278)","v":702},{"$f":"IF(M279=0,0,H279/M279)","v":0.79304812834224603},{"$f":"IF(M279=0,0,K279/M279)","v":0.11443850267379679},{"$f":"IF(M279=0,0,L279/M279)","v":9.251336898395722E-2},{"$f":"L279*100/B$1285","v":6113.0742049469964}]
["2020-04-02T17:00:00",4,"P.A. Trento",339,78,417,1170,1587,104,133,229,187,2003,8496,{"$f":"IF(P280=\"x2\",M280,O279)","v":1594},{"$f":"IF(M280>O279*2,\"x2\",O279)","v":1594},{"$f":"IF(P280=\"x2\",M280,\"\")","v":""},null,{"$f":"M280*100/M1333","v":1.7380816021936447},{"$f":"IF(J280-J279=0,\"\",J280-J279)","v":9},{"$f":"IF(K280-K279=0,\"\",K280-K279)","v":15},{"$f":"IF(L280-L279=0,\"\",L280-L279)","v":14},{"$f":"IF(M280-M279=0,\"\",M280-M279)","v":133},821,0.79231153270094856,0.11432850723914129,9.3359960059910138E-2,{"$f":"L280*100/B$1285","v":6607.7738515901056}]
["2020-04-03T17:00:00",4,"P.A. Trento",343,80,423,1236,1659,72,106,246,204,2109,8993,{"$f":"IF(P281=\"x2\",M281,O280)","v":1594},{"$f":"IF(M281>O280*2,\"x2\",O280)","v":1594},{"$f":"IF(P281=\"x2\",M281,\"\")","v":""},null,{"$f":"M281*100/M1334","v":1.7600373872332613},{"$f":"IF(J281-J280=0,\"\",J281-J280)","v":-27},{"$f":"IF(K281-K280=0,\"\",K281-K280)","v":17},{"$f":"IF(L281-L280=0,\"\",L281-L280)","v":17},{"$f":"IF(M281-M280=0,\"\",M281-M280)","v":106},497,0.78662873399715505,0.11664295874822191,9.6728307254623044E-2,{"$f":"L281*100/B$1285","v":7208.4805653710246}]
["2020-04-04T17:00:00",4,"P.A. Trento",353,81,434,1319,1753,94,111,257,210,2220,9863,{"$f":"IF(P282=\"x2\",M282,O281)","v":1594},{"$f":"IF(M282>O281*2,\"x2\",O281)","v":1594},{"$f":"IF(P282=\"x2\",M282,\"\")","v":""},null,{"$f":"M282*100/M1335","v":1.7812439822838437},{"$f":"IF(J282-J281=0,\"\",J282-J281)","v":5},{"$f":"IF(K282-K281=0,\"\",K282-K281)","v":11},{"$f":"IF(L282-L281=0,\"\",L282-L281)","v":6},{"$f":"IF(M282-M281=0,\"\",M282-M281)","v":111},870,0.78963963963963968,0.11576576576576576,9.45945945945946E-2,{"$f":"L282*100/B$1285","v":7420.4946996466433}]
["2020-04-05T17:00:00",4,"P.A. Trento",352,80,432,1363,1795,42,65,273,217,2285,10476,{"$f":"IF(P283=\"x2\",M283,O282)","v":1594},{"$f":"IF(M283>O282*2,\"x2\",O282)","v":1594},{"$f":"IF(P283=\"x2\",M283,\"\")","v":""},null,{"$f":"M283*100/M1336","v":1.7720321369854515},{"$f":"IF(J283-J282=0,\"\",J283-J282)","v":-46},{"$f":"IF(K283-K282=0,\"\",K283-K282)","v":16},{"$f":"IF(L283-L282=0,\"\",L283-L282)","v":7},{"$f":"IF(M283-M282=0,\"\",M283-M282)","v":65},613,0.78555798687089717,0.11947483588621444,9.4967177242888404E-2,{"$f":"L283*100/B$1285","v":7667.8445229681975}]
["2020-04-06T17:00:00",4,"P.A. Trento",354,79,433,1405,1838,43,63,280,230,2348,11130,{"$f":"IF(P284=\"x2\",M284,O283)","v":1594},{"$f":"IF(M284>O283*2,\"x2\",O283)","v":1594},{"$f":"IF(P284=\"x2\",M284,\"\")","v":""},null,{"$f":"M284*100/M1337","v":1.7714471093272575},{"$f":"IF(J284-J283=0,\"\",J284-J283)","v":-2},{"$f":"IF(K284-K283=0,\"\",K284-K283)","v":7},{"$f":"IF(L284-L283=0,\"\",L284-L283)","v":13},{"$f":"IF(M284-M283=0,\"\",M284-M283)","v":63},654,0.782793867120954,0.11925042589437819,9.7955706984667809E-2,{"$f":"L284*100/B$1285","v":8127.2084805653712}]
["2020-04-07T17:00:00",4,"P.A. Trento",360,78,438,1452,1890,52,128,342,244,2476,12030,{"$f":"IF(P285=\"x2\",M285,O284)","v":1594},{"$f":"IF(M285>O284*2,\"x2\",O284)","v":1594},{"$f":"IF(P285=\"x2\",M285,\"\")","v":""},null,{"$f":"M285*100/M1338","v":1.8261472423406546},{"$f":"IF(J285-J284=0,\"\",J285-J284)","v":65},{"$f":"IF(K285-K284=0,\"\",K285-K284)","v":62},{"$f":"IF(L285-L284=0,\"\",L285-L284)","v":14},{"$f":"IF(M285-M284=0,\"\",M285-M284)","v":128},{"$f":"IF(N285-N284=0,\"\",N285-N284)","v":900},{"$f":"IF(M285=0,0,H285/M285)","v":0.76332794830371564},{"$f":"IF(M285=0,0,K285/M285)","v":0.1381260096930533},{"$f":"IF(M285=0,0,L285/M285)","v":9.8546042003231013E-2},{"$f":"L285*100/B$1285","v":8621.9081272084804}]
["2020-04-08T17:00:00",4,"P.A. Trento",354,77,431,1509,1940,50,126,407,255,2602,13258,{"$f":"IF(P286=\"x2\",M286,O285)","v":1594},{"$f":"IF(M286>O285*2,\"x2\",O285)","v":1594},{"$f":"IF(P286=\"x2\",M286,\"\")","v":""},null,{"$f":"M286*100/M1339","v":1.8662764843424997},{"$f":"IF(J286-J285=0,\"\",J286-J285)","v":-2},{"$f":"IF(K286-K285=0,\"\",K286-K285)","v":65},{"$f":"IF(L286-L285=0,\"\",L286-L285)","v":11},{"$f":"IF(M286-M285=0,\"\",M286-M285)","v":126},{"$f":"IF(N286-N285=0,\"\",N286-N285)","v":1228},{"$f":"IF(M286=0,0,H286/M286)","v":0.74558032282859343},{"$f":"IF(M286=0,0,K286/M286)","v":0.15641813989239048},{"$f":"IF(M286=0,0,L286/M286)","v":9.8001537279016143E-2},{"$f":"L286*100/B$1285","v":9010.6007067137798}]
["2020-04-09T17:00:00",4,"P.A. Trento",345,69,414,1564,1978,38,106,462,268,2708,14338,{"$f":"IF(P287=\"x2\",M287,O286)","v":1594},{"$f":"IF(M287>O286*2,\"x2\",O286)","v":1594},{"$f":"IF(P287=\"x2\",M287,\"\")","v":""},null,{"$f":"M287*100/M1340","v":1.8854524946736664},{"$f":"IF(J287-J286=0,\"\",J287-J286)","v":-20},{"$f":"IF(K287-K286=0,\"\",K287-K286)","v":55},{"$f":"IF(L287-L286=0,\"\",L287-L286)","v":13},{"$f":"IF(M287-M286=0,\"\",M287-M286)","v":106},{"$f":"IF(N287-N286=0,\"\",N287-N286)","v":1080},{"$f":"IF(M287=0,0,H287/M287)","v":0.73042836041358938},{"$f":"IF(M287=0,0,K287/M287)","v":0.17060561299852289},{"$f":"IF(M287=0,0,L287/M287)","v":9.8966026587887737E-2},{"$f":"L287*100/B$1285","v":9469.9646643109536}]
["2020-04-10T17:00:00",4,"P.A. Trento",335,70,405,1589,1994,16,108,547,275,2816,14981,{"$f":"IF(P288=\"x2\",M288,O287)","v":1594},{"$f":"IF(M288>O287*2,\"x2\",O287)","v":1594},{"$f":"IF(P288=\"x2\",M288,\"\")","v":""},null,{"$f":"M288*100/M1341","v":1.908156420038353},{"$f":"IF(J288-J287=0,\"\",J288-J287)","v":2},{"$f":"IF(K288-K287=0,\"\",K288-K287)","v":85},{"$f":"IF(L288-L287=0,\"\",L288-L287)","v":7},{"$f":"IF(M288-M287=0,\"\",M288-M287)","v":108},{"$f":"IF(N288-N287=0,\"\",N288-N287)","v":643},{"$f":"IF(M288=0,0,H288/M288)","v":0.70809659090909094},{"$f":"IF(M288=0,0,K288/M288)","v":0.19424715909090909},{"$f":"IF(M288=0,0,L288/M288)","v":9.765625E-2},{"$f":"L288*100/B$1285","v":9717.3144876325077}]
["2020-04-11T17:00:00",4,"P.A. Trento",335,62,397,1667,2064,70,154,622,284,2970,16646,{"$f":"IF(P289=\"x2\",M289,O288)","v":1594},{"$f":"IF(M289>O288*2,\"x2\",O288)","v":1594},{"$f":"IF(P289=\"x2\",M289,\"\")","v":""},null,{"$f":"M289*100/M1342","v":1.9504698859270642},{"$f":"IF(J289-J288=0,\"\",J289-J288)","v":46},{"$f":"IF(K289-K288=0,\"\",K289-K288)","v":75},{"$f":"IF(L289-L288=0,\"\",L289-L288)","v":9},{"$f":"IF(M289-M288=0,\"\",M289-M288)","v":154},{"$f":"IF(N289-N288=0,\"\",N289-N288)","v":1665},{"$f":"IF(M289=0,0,H289/M289)","v":0.69494949494949498},{"$f":"IF(M289=0,0,K289/M289)","v":0.20942760942760943},{"$f":"IF(M289=0,0,L289/M289)","v":9.5622895622895623E-2},{"$f":"L289*100/B$1285","v":10035.335689045936}]
["2020-04-12T17:00:00",4,"P.A. Trento",322,61,383,1699,2082,18,83,678,293,3053,17797,{"$f":"IF(P290=\"x2\",M290,O289)","v":1594},{"$f":"IF(M290>O289*2,\"x2\",O289)","v":1594},{"$f":"IF(P290=\"x2\",M290,\"\")","v":""},null,{"$f":"M290*100/M1343","v":1.9525079462532697},{"$f":"IF(J290-J289=0,\"\",J290-J289)","v":-71},{"$f":"IF(K290-K289=0,\"\",K290-K289)","v":56},{"$f":"IF(L290-L289=0,\"\",L290-L289)","v":9},{"$f":"IF(M290-M289=0,\"\",M290-M289)","v":83},{"$f":"IF(N290-N289=0,\"\",N290-N289)","v":1151},{"$f":"IF(M290=0,0,H290/M290)","v":0.68195217818539144},{"$f":"IF(M290=0,0,K290/M290)","v":0.2220766459220439},{"$f":"IF(M290=0,0,L290/M290)","v":9.5971175892564695E-2},{"$f":"L290*100/B$1285","v":10353.356890459363}]
["2020-04-13T17:00:00",4,"P.A. Trento",326,56,382,1698,2080,-2,73,746,300,3126,18586,{"$f":"IF(P291=\"x2\",M291,O290)","v":1594},{"$f":"IF(M291>O290*2,\"x2\",O290)","v":1594},{"$f":"IF(P291=\"x2\",M291,\"\")","v":""},null,{"$f":"M291*100/M1344","v":1.959678026028737},{"$f":"IF(J291-J290=0,\"\",J291-J290)","v":-10},{"$f":"IF(K291-K290=0,\"\",K291-K290)","v":68},{"$f":"IF(L291-L290=0,\"\",L291-L290)","v":7},{"$f":"IF(M291-M290=0,\"\",M291-M290)","v":73},{"$f":"IF(N291-N290=0,\"\",N291-N290)","v":789},{"$f":"IF(M291=0,0,H291/M291)","v":0.66538707613563663},{"$f":"IF(M291=0,0,K291/M291)","v":0.23864363403710812},{"$f":"IF(M291=0,0,L291/M291)","v":9.5969289827255277E-2},{"$f":"L291*100/B$1285","v":10600.706713780919}]
["2020-04-14T17:00:00",4,"P.A. Trento",325,54,379,1703,2082,2,15,749,310,3141,18774,{"$f":"IF(P292=\"x2\",M292,O291)","v":1594},{"$f":"IF(M292>O291*2,\"x2\",O291)","v":1594},{"$f":"IF(P292=\"x2\",M292,\"\")","v":""},null,{"$f":"M292*100/M1345","v":1.933065826399488},{"$f":"IF(J292-J291=0,\"\",J292-J291)","v":-58},{"$f":"IF(K292-K291=0,\"\",K292-K291)","v":3},{"$f":"IF(L292-L291=0,\"\",L292-L291)","v":10},{"$f":"IF(M292-M291=0,\"\",M292-M291)","v":15},{"$f":"IF(N292-N291=0,\"\",N292-N291)","v":188},{"$f":"IF(M292=0,0,H292/M292)","v":0.6628462273161414},{"$f":"IF(M292=0,0,K292/M292)","v":0.23845908946195479},{"$f":"IF(M292=0,0,L292/M292)","v":9.8694683221903848E-2},{"$f":"L292*100/B$1285","v":10954.063604240282}]
["2020-04-15T17:00:00",4,"P.A. Trento",312,48,360,1744,2104,22,79,798,318,3220,19535,{"$f":"IF(P293=\"x2\",M293,O292)","v":3220},{"$f":"IF(M293>O292*2,\"x2\",O292)","v":"x2"},{"$f":"IF(P293=\"x2\",M293,\"\")","v":3220},null,{"$f":"M293*100/M1346","v":1.9496836305288971},{"$f":"IF(J293-J292=0,\"\",J293-J292)","v":64},{"$f":"IF(K293-K292=0,\"\",K293-K292)","v":49},{"$f":"IF(L293-L292=0,\"\",L293-L292)","v":8},{"$f":"IF(M293-M292=0,\"\",M293-M292)","v":79},{"$f":"IF(N293-N292=0,\"\",N293-N292)","v":761},{"$f":"IF(M293=0,0,H293/M293)","v":0.65341614906832302},{"$f":"IF(M293=0,0,K293/M293)","v":0.24782608695652175},{"$f":"IF(M293=0,0,L293/M293)","v":9.8757763975155274E-2},{"$f":"L293*100/B$1285","v":11236.749116607774}]
[{"$f":"A293 + 1","v":"2020-04-16T17:00:00"},null,null,null,null,null,null,null,null,null,null,null,null,null,null,"Media x2",{"$f":"COUNT(M242:M293) / COUNT(Q242:Q293)","v":5.2}]
[{"$f":"A294+1","v":"2020-04-17T17:00:00"}]
[{"$f":"A295+1","v":"2020-04-18T17:00:00"}]
[null,null,null,null,{"$f":"E293/$M293","v":1.4906832298136646E-2},null,null,{"$f":"H293/$M293","v":0.65341614906832302},null,null,{"$f":"K293/$M293","v":0.24782608695652175},{"$f":"L293/$M293","v":9.8757763975155274E-2},null,{"$f":"N293/$M293","v":6.066770186335404}]
[]
[]
[]
["Data","Codice","Regione","Ricoverati","Terap. Intens.","Ospedalizzati","Quarantena","Positivi","+ Positivi","Nuovi","Guariti","Deceduti","Totale","Tamponi",null,null,"x 2",null,"% su Tot.","+ Nuovi","+ Guariti","+ Deceduti","+ Totali","+ Tamponi","% Positivi","% Guariti","% Deceduti","P. Stimati"]
["2020-02-24T18:00:00",5,"Veneto",12,4,16,16,32,0,32,0,1,33,2200,{"$f":"M302","v":33},null,{"$f":"M302","v":33},null,{"$f":"M302*100/M1295","v":14.410480349344978},null,null,null,null,null,{"$f":"IF(M302=0,0,H302/M302)","v":0.96969696969696972},{"$f":"IF(M302=0,0,K302/M302)","v":0},{"$f":"IF(M302=0,0,L302/M302)","v":3.0303030303030304E-2},{"$f":"L302*100/B$1285","v":35.335689045936398}]
["2020-02-25T18:00:00",5,"Veneto",12,7,19,23,42,10,10,0,1,43,3780,{"$f":"IF(P303=\"x2\",M303,O302)","v":33},{"$f":"IF(M303>O302*2,\"x2\",O302)","v":33},{"$f":"IF(P303=\"x2\",M303,\"\")","v":""},null,{"$f":"M303*100/M1296","v":13.354037267080745},{"$f":"IF(J303-J302=0,\"\",J303-J302)","v":-22},{"$f":"IF(K303-K302=0,\"\",K303-K302)","v":""},{"$f":"IF(L303-L302=0,\"\",L303-L302)","v":""},{"$f":"IF(M303-M302=0,\"\",M303-M302)","v":10},{"$f":"IF(N303-N302=0,\"\",N303-N302)","v":1580},0.97674418604651159,0,2.3255813953488372E-2,{"$f":"L303*100/B$1285","v":35.335689045936398}]
["2020-02-26T18:00:00",5,"Veneto",16,8,24,45,69,27,27,0,2,71,4900,71,"x2",71,null,{"$f":"M304*100/M1297","v":17.75},17,"",1,28,1120,0.971830985915493,0,2.8169014084507043E-2,{"$f":"L304*100/B$1285","v":70.671378091872796}]
["2020-02-27T18:00:00",5,"Veneto",19,8,27,82,109,40,40,0,2,111,6164,71,71,"",null,{"$f":"M305*100/M1298","v":17.076923076923077},13,"","",40,1264,0.98198198198198194,0,1.8018018018018018E-2,{"$f":"L305*100/B$1285","v":70.671378091872796}]
["2020-02-28T18:00:00",5,"Veneto",24,9,33,116,149,40,40,0,2,151,7414,151,"x2",151,null,{"$f":"M306*100/M1299","v":17.004504504504503},"","","",40,1250,0.98675496688741726,0,1.3245033112582781E-2,{"$f":"L306*100/B$1285","v":70.671378091872796}]
["2020-02-29T17:00:00",5,"Veneto",24,11,35,154,189,40,40,0,2,191,8659,151,151,"",null,{"$f":"M307*100/M1300","v":16.932624113475178},"","","",40,1245,0.98952879581151831,0,1.0471204188481676E-2,{"$f":"L307*100/B$1285","v":70.671378091872796}]
["2020-03-01T17:00:00",5,"Veneto",51,13,64,197,261,72,72,0,2,263,9056,151,151,"",null,{"$f":"M308*100/M1301","v":15.52538370720189},32,"","",72,397,0.99239543726235746,0,7.6045627376425855E-3,{"$f":"L308*100/B$1285","v":70.671378091872796}]
["2020-03-02T18:00:00",5,"Veneto",53,14,67,204,271,10,10,0,2,273,9782,151,151,"",null,{"$f":"M309*100/M1302","v":13.408644400785855},-62,"","",10,726,0.9926739926739927,0,7.326007326007326E-3,{"$f":"L309*100/B$1285","v":70.671378091872796}]
["2020-03-03T18:00:00",5,"Veneto",49,19,68,229,297,26,26,7,3,307,10176,307,"x2",307,null,{"$f":"M310*100/M1303","v":12.270183852917667},16,7,1,34,394,0.96742671009771986,2.2801302931596091E-2,9.7719869706840382E-3,{"$f":"L310*100/B$1285","v":106.00706713780919}]
["2020-03-04T17:00:00",5,"Veneto",76,23,99,246,345,48,48,9,6,360,10515,307,307,"",null,{"$f":"M311*100/M1304","v":11.654257041113629},22,2,3,53,339,0.95833333333333337,2.5000000000000001E-2,1.6666666666666666E-2,{"$f":"L311*100/B$1285","v":212.01413427561837}]
["2020-03-05T17:00:00",5,"Veneto",92,24,116,264,380,35,35,17,10,407,11949,307,307,"",null,{"$f":"M312*100/M1305","v":10.549507516848108},-13,8,4,47,1434,0.93366093366093361,4.1769041769041768E-2,2.4570024570024569E-2,{"$f":"L312*100/B$1285","v":353.35689045936397}]
["2020-03-06T17:00:00",5,"Veneto",117,27,144,310,454,74,74,22,12,488,13023,307,307,"",null,{"$f":"M313*100/M1306","v":10.526315789473685},39,5,2,81,1074,0.93032786885245899,4.5081967213114756E-2,2.4590163934426229E-2,{"$f":"L313*100/B$1285","v":424.02826855123675}]
["2020-03-07T18:00:00",5,"Veneto",123,41,164,341,505,51,51,25,13,543,14429,307,307,"",null,{"$f":"M314*100/M1307","v":9.2299847016828149},-23,3,1,55,1406,0.93001841620626147,4.6040515653775323E-2,2.3941068139963169E-2,{"$f":"L314*100/B$1285","v":459.36395759717311}]
["2020-03-08T18:00:00",5,"Veneto",146,47,193,430,623,118,118,29,18,670,15918,670,"x2",670,null,{"$f":"M315*100/M1308","v":9.0847457627118651},67,4,5,127,1489,0.92985074626865671,4.3283582089552242E-2,2.6865671641791045E-2,{"$f":"L315*100/B$1285","v":636.0424028268551}]
["2020-03-09T18:00:00",5,"Veneto",186,51,237,457,694,71,71,30,20,744,15956,670,670,"",null,{"$f":"M316*100/M1309","v":8.1116441343218497},-47,1,2,74,38,0.93279569892473113,4.0322580645161289E-2,2.6881720430107527E-2,{"$f":"L316*100/B$1285","v":706.71378091872793}]
["2020-03-10T18:00:00",5,"Veneto",204,67,271,512,783,89,89,47,26,856,16643,670,670,"",null,{"$f":"M317*100/M1310","v":8.4343285052714556},18,17,6,112,687,0.91471962616822433,5.4906542056074766E-2,3.0373831775700934E-2,{"$f":"L317*100/B$1285","v":918.72791519434622}]
["2020-03-11T17:00:00",5,"Veneto",262,68,330,610,940,157,157,54,29,1023,21400,670,670,"",null,{"$f":"M318*100/M1311","v":8.2089552238805972},68,7,3,167,4757,0.9188660801564027,5.2785923753665691E-2,2.8347996089931573E-2,{"$f":"L318*100/B$1285","v":1024.7349823321554}]
["2020-03-12T17:00:00",5,"Veneto",360,85,445,852,1297,357,357,55,32,1384,23438,1384,"x2",1384,null,{"$f":"M319*100/M1312","v":9.1576788195593206},200,1,3,361,2038,0.93713872832369938,3.9739884393063585E-2,2.3121387283236993E-2,{"$f":"L319*100/B$1285","v":1130.7420494699647}]
["2020-03-13T17:00:00",5,"Veneto",366,107,473,980,1453,156,156,100,42,1595,25691,1384,1384,"",null,{"$f":"M320*100/M1313","v":9.0317100792751983},-201,45,10,211,2253,0.91097178683385582,6.2695924764890276E-2,2.6332288401253918E-2,{"$f":"L320*100/B$1285","v":1484.0989399293285}]
["2020-03-14T17:00:00",5,"Veneto",366,119,485,1290,1775,322,322,107,55,1937,26980,1384,1384,"",null,{"$f":"M321*100/M1314","v":9.155362291440186},166,7,13,342,1289,0.91636551368094987,5.5240061951471346E-2,2.8394424367578729E-2,{"$f":"L321*100/B$1285","v":1943.4628975265018}]
["2020-03-15T17:00:00",5,"Veneto",426,129,555,1434,1989,214,214,120,63,2172,32546,1384,1384,"",null,{"$f":"M322*100/M1315","v":8.7768214329009577},-108,13,8,235,5566,0.91574585635359118,5.5248618784530384E-2,2.9005524861878452E-2,{"$f":"L322*100/B$1285","v":2226.1484098939927}]
["2020-03-16T17:00:00",5,"Veneto",498,156,654,1620,2274,285,285,130,69,2473,35052,1384,1384,"",null,{"$f":"M323*100/M1316","v":8.838456040028591},71,10,6,301,2506,0.91953093408815201,5.2567731500202185E-2,2.7901334411645773E-2,{"$f":"L323*100/B$1285","v":2438.1625441696115}]
["2020-03-17T17:00:00",5,"Veneto",548,171,719,1769,2488,214,214,136,80,2704,35478,1384,1384,"",null,{"$f":"M324*100/M1317","v":8.5824922237034222},-71,6,11,231,426,0.92011834319526631,5.0295857988165681E-2,2.9585798816568046E-2,{"$f":"L324*100/B$1285","v":2826.8551236749117}]
["2020-03-18T17:00:00",5,"Veneto",646,195,841,2112,2953,465,465,167,94,3214,40841,3214,"x2",3214,null,{"$f":"M325*100/M1318","v":8.9995239828633835},251,31,14,510,5363,0.91879278158058497,5.1960174237710016E-2,2.924704418170504E-2,{"$f":"L325*100/B$1285","v":3321.5547703180209}]
["2020-03-19T17:00:00",5,"Veneto",771,209,980,2189,3169,216,216,200,115,3484,44658,3214,3214,"",null,{"$f":"M326*100/M1319","v":8.4903131473132696},-249,33,21,270,3817,0.90958668197474168,5.7405281285878303E-2,3.300803673938002E-2,{"$f":"L326*100/B$1285","v":4063.6042402826856}]
["2020-03-20T17:00:00",5,"Veneto",843,236,1079,2598,3677,508,508,223,131,4031,49288,3214,3214,"",null,{"$f":"M327*100/M1320","v":8.5727653601582272},292,23,16,547,{"$f":"IF(N327-N326=0,\"\",N327-N326)","v":4630},0.91218060034730841,5.5321260233192754E-2,3.2498139419498882E-2,{"$f":"L327*100/B$1285","v":4628.9752650176679}]
["2020-03-21T17:00:00",5,"Veneto",942,249,1191,3023,4214,537,537,257,146,4617,53642,3214,3214,"",null,{"$f":"M328*100/M1321","v":8.6173429392661163},29,34,15,{"$f":"IF(M328-M327=0,\"\",M328-M327)","v":586},4354,0.91271388347411742,5.5663850985488414E-2,3.1622265540394198E-2,{"$f":"L328*100/B$1285","v":5159.0106007067134}]
["2020-03-22T17:00:00",5,"Veneto",1113,255,1368,3276,4644,430,430,309,169,5122,57671,3214,3214,"",null,{"$f":"M329*100/M1322","v":8.6610977713145516},-107,52,23,505,4029,0.90667707926591179,6.0327996876220223E-2,3.2994923857868022E-2,{"$f":"L329*100/B$1285","v":5971.7314487632511}]
["2020-03-23T17:00:00",5,"Veneto",1206,281,1487,3499,4986,342,342,327,192,5505,61115,3214,3214,"",null,{"$f":"M330*100/M1323","v":8.6113848608569157},-88,18,23,383,3444,0.9057220708446867,5.9400544959128068E-2,3.4877384196185288E-2,{"$f":"L330*100/B$1285","v":6784.452296819788}]
["2020-03-24T17:00:00",5,"Veneto",1318,304,1622,3729,5351,365,365,381,216,5948,66178,3214,3214,"",null,{"$f":"M331*100/M1324","v":8.5983578119579036},23,54,24,443,5063,0.89963012777404172,6.4055144586415605E-2,3.6314727639542702E-2,{"$f":"L331*100/B$1285","v":7632.5088339222611}]
["2020-03-25T17:00:00",5,"Veneto",1407,316,1723,4022,5745,394,394,439,258,6442,70877,6442,"x2",6442,null,{"$f":"M332*100/M1325","v":8.6602317640416207},29,58,42,494,4699,0.89180378764358892,6.8146538342129775E-2,4.0049674014281278E-2,{"$f":"L332*100/B$1285","v":9116.6077738515905}]
["2020-03-26T17:00:00",5,"Veneto",1447,326,1773,4367,6140,395,395,508,287,6935,79759,6442,6442,"",null,{"$f":"M333*100/M1326","v":8.6107351717801315},1,69,29,493,{"$f":"IF(N333-N332=0,\"\",N333-N332)","v":8882},0.88536409516943038,7.3251622206200434E-2,4.1384282624369141E-2,{"$f":"L333*100/B$1285","v":10141.342756183745}]
["2020-03-27T17:00:00",5,"Veneto",1536,338,1874,4774,6648,508,562,536,313,7497,83627,{"$f":"IF(P334=\"x2\",M334,O333)","v":6442},{"$f":"IF(M334>O333*2,\"x2\",O333)","v":6442},{"$f":"IF(P334=\"x2\",M334,\"\")","v":""},null,{"$f":"M334*100/M1327","v":8.6672524220213187},{"$f":"IF(J334-J333=0,\"\",J334-J333)","v":167},28,26,562,3868,0.88675470188075234,7.1495264772575701E-2,4.1750033346672002E-2,{"$f":"L334*100/B$1285","v":11060.070671378091}]
["2020-03-28T17:00:00",5,"Veneto",1559,344,1903,5010,6913,265,433,655,362,7930,89380,6442,6442,"",null,{"$f":"M335*100/M1328","v":8.5755688208322525},-129,119,49,433,5753,0.8717528373266078,8.2597730138713743E-2,4.5649432534678437E-2,{"$f":"L335*100/B$1285","v":12791.519434628975}]
["2020-03-29T17:00:00",5,"Veneto",1586,355,1941,5310,7251,338,428,715,392,8358,94784,6442,6442,"",null,{"$f":"M336*100/M1329","v":8.5557227528176156},-5,60,30,428,5404,0.8675520459440057,8.5546781526681021E-2,4.690117252931323E-2,{"$f":"L336*100/B$1285","v":13851.590106007066}]
["2020-03-30T17:00:00",5,"Veneto",1633,356,1989,5575,7564,313,366,747,413,8724,99941,6442,6442,"",null,{"$f":"M337*100/M1330","v":8.5748827883112675},-62,32,21,366,5157,0.86703347088491522,8.5625859697386522E-2,4.7340669417698301E-2,{"$f":"L337*100/B$1285","v":14593.639575971731}]
["2020-03-31T17:00:00",5,"Veneto",1680,356,2036,5814,7850,286,431,828,477,9155,106238,6442,6442,"",null,{"$f":"M338*100/M1331","v":8.6537734422262549},65,81,64,431,6297,0.85745494265428723,9.0442381212452211E-2,5.2102676133260514E-2,{"$f":"L338*100/B$1285","v":16855.123674911662}]
["2020-04-01T17:00:00",5,"Veneto",1718,350,2068,6156,8224,374,470,902,499,9625,112746,6442,6442,"",null,{"$f":"M339*100/M1332","v":8.7045779297122294},39,74,22,470,{"$f":"IF(N339-N338=0,\"\",N339-N338)","v":6508},{"$f":"IF(M339=0,0,H339/M339)","v":0.85444155844155845},{"$f":"IF(M339=0,0,K339/M339)","v":9.3714285714285708E-2},{"$f":"IF(M339=0,0,L339/M339)","v":5.1844155844155845E-2},{"$f":"L339*100/B$1285","v":17632.50883392226}]
["2020-04-02T17:00:00",5,"Veneto",1670,345,2015,6563,8578,354,486,1001,532,10111,120320,{"$f":"IF(P340=\"x2\",M340,O339)","v":6442},{"$f":"IF(M340>O339*2,\"x2\",O339)","v":6442},{"$f":"IF(P340=\"x2\",M340,\"\")","v":""},null,{"$f":"M340*100/M1333","v":8.7737109734298251},{"$f":"IF(J340-J339=0,\"\",J340-J339)","v":16},{"$f":"IF(K340-K339=0,\"\",K340-K339)","v":99},{"$f":"IF(L340-L339=0,\"\",L340-L339)","v":33},{"$f":"IF(M340-M339=0,\"\",M340-M339)","v":486},7574,0.8483829492631787,9.9001087924043121E-2,5.261596281277816E-2,{"$f":"L340*100/B$1285","v":18798.586572438162}]
["2020-04-03T17:00:00",5,"Veneto",1714,335,2049,6812,8861,283,353,1031,572,10464,126490,{"$f":"IF(P341=\"x2\",M341,O340)","v":6442},{"$f":"IF(M341>O340*2,\"x2\",O340)","v":6442},{"$f":"IF(P341=\"x2\",M341,\"\")","v":""},null,{"$f":"M341*100/M1334","v":8.7325894831715729},{"$f":"IF(J341-J340=0,\"\",J341-J340)","v":-133},{"$f":"IF(K341-K340=0,\"\",K341-K340)","v":30},{"$f":"IF(L341-L340=0,\"\",L341-L340)","v":40},{"$f":"IF(M341-M340=0,\"\",M341-M340)","v":353},6170,0.84680810397553519,9.8528287461773695E-2,5.4663608562691132E-2,{"$f":"L341*100/B$1285","v":20212.014134275618}]
["2020-04-04T17:00:00",5,"Veneto",1691,324,2015,7078,9093,232,360,1124,607,10824,133289,{"$f":"IF(P342=\"x2\",M342,O341)","v":6442},{"$f":"IF(M342>O341*2,\"x2\",O341)","v":6442},{"$f":"IF(P342=\"x2\",M342,\"\")","v":""},null,{"$f":"M342*100/M1335","v":8.6847679568650111},{"$f":"IF(J342-J341=0,\"\",J342-J341)","v":7},{"$f":"IF(K342-K341=0,\"\",K342-K341)","v":93},{"$f":"IF(L342-L341=0,\"\",L342-L341)","v":35},{"$f":"IF(M342-M341=0,\"\",M342-M341)","v":360},6799,0.84007760532150777,0.10384331116038432,5.6079083518107906E-2,{"$f":"L342*100/B$1285","v":21448.763250883392}]
["2020-04-05T17:00:00",5,"Veneto",1674,329,2003,7406,9409,316,402,1186,631,11226,140910,{"$f":"IF(P343=\"x2\",M343,O342)","v":6442},{"$f":"IF(M343>O342*2,\"x2\",O342)","v":6442},{"$f":"IF(P343=\"x2\",M343,\"\")","v":""},null,{"$f":"M343*100/M1336","v":8.7058349101963586},{"$f":"IF(J343-J342=0,\"\",J343-J342)","v":42},{"$f":"IF(K343-K342=0,\"\",K343-K342)","v":62},{"$f":"IF(L343-L342=0,\"\",L343-L342)","v":24},{"$f":"IF(M343-M342=0,\"\",M343-M342)","v":402},7621,0.83814359522536963,0.10564760377694637,5.6208800997683946E-2,{"$f":"L343*100/B$1285","v":22296.819787985864}]
["2020-04-06T17:00:00",5,"Veneto",1714,322,2036,7686,9722,313,362,1204,662,11588,146288,{"$f":"IF(P344=\"x2\",M344,O343)","v":6442},{"$f":"IF(M344>O343*2,\"x2\",O343)","v":6442},{"$f":"IF(P344=\"x2\",M344,\"\")","v":""},null,{"$f":"M344*100/M1337","v":8.7425592431363963},{"$f":"IF(J344-J343=0,\"\",J344-J343)","v":-40},{"$f":"IF(K344-K343=0,\"\",K344-K343)","v":18},{"$f":"IF(L344-L343=0,\"\",L344-L343)","v":31},{"$f":"IF(M344-M343=0,\"\",M344-M343)","v":362},5378,0.83897134967207454,0.10390058681394546,5.7128063513979976E-2,{"$f":"L344*100/B$1285","v":23392.226148409893}]
["2020-04-07T17:00:00",5,"Veneto",1579,297,1876,8089,9965,243,337,1265,695,11925,153542,{"$f":"IF(P345=\"x2\",M345,O344)","v":6442},{"$f":"IF(M345>O344*2,\"x2\",O344)","v":6442},{"$f":"IF(P345=\"x2\",M345,\"\")","v":""},null,{"$f":"M345*100/M1338","v":8.7951558420485885},{"$f":"IF(J345-J344=0,\"\",J345-J344)","v":-25},{"$f":"IF(K345-K344=0,\"\",K345-K344)","v":61},{"$f":"IF(L345-L344=0,\"\",L345-L344)","v":33},{"$f":"IF(M345-M344=0,\"\",M345-M344)","v":337},{"$f":"IF(N345-N344=0,\"\",N345-N344)","v":7254},{"$f":"IF(M345=0,0,H345/M345)","v":0.83563941299790356},{"$f":"IF(M345=0,0,K345/M345)","v":0.1060796645702306},{"$f":"IF(M345=0,0,L345/M345)","v":5.8280922431865827E-2},{"$f":"L345*100/B$1285","v":24558.303886925794}]
["2020-04-08T17:00:00",5,"Veneto",1554,285,1839,8332,10171,206,485,1503,736,12410,163247,{"$f":"IF(P346=\"x2\",M346,O345)","v":6442},{"$f":"IF(M346>O345*2,\"x2\",O345)","v":6442},{"$f":"IF(P346=\"x2\",M346,\"\")","v":""},null,{"$f":"M346*100/M1339","v":8.90103427005781},{"$f":"IF(J346-J345=0,\"\",J346-J345)","v":148},{"$f":"IF(K346-K345=0,\"\",K346-K345)","v":238},{"$f":"IF(L346-L345=0,\"\",L346-L345)","v":41},{"$f":"IF(M346-M345=0,\"\",M346-M345)","v":485},{"$f":"IF(N346-N345=0,\"\",N346-N345)","v":9705},{"$f":"IF(M346=0,0,H346/M346)","v":0.81958098307816274},{"$f":"IF(M346=0,0,K346/M346)","v":0.12111200644641418},{"$f":"IF(M346=0,0,L346/M346)","v":5.9307010475423048E-2},{"$f":"L346*100/B$1285","v":26007.067137809187}]
["2020-04-09T17:00:00",5,"Veneto",1530,274,1804,8645,10449,278,523,1728,756,12933,171456,{"$f":"IF(P347=\"x2\",M347,O346)","v":12933},{"$f":"IF(M347>O346*2,\"x2\",O346)","v":"x2"},{"$f":"IF(P347=\"x2\",M347,\"\")","v":12933},null,{"$f":"M347*100/M1340","v":9.0046370434322469},{"$f":"IF(J347-J346=0,\"\",J347-J346)","v":38},{"$f":"IF(K347-K346=0,\"\",K347-K346)","v":225},{"$f":"IF(L347-L346=0,\"\",L347-L346)","v":20},{"$f":"IF(M347-M346=0,\"\",M347-M346)","v":523},{"$f":"IF(N347-N346=0,\"\",N347-N346)","v":8209},{"$f":"IF(M347=0,0,H347/M347)","v":0.8079331941544885},{"$f":"IF(M347=0,0,K347/M347)","v":0.1336116910229645},{"$f":"IF(M347=0,0,L347/M347)","v":5.845511482254697E-2},{"$f":"L347*100/B$1285","v":26713.780918727916}]
["2020-04-10T17:00:00",5,"Veneto",1521,257,1778,8869,10647,198,488,1981,793,13421,180700,{"$f":"IF(P348=\"x2\",M348,O347)","v":12933},{"$f":"IF(M348>O347*2,\"x2\",O347)","v":12933},{"$f":"IF(P348=\"x2\",M348,\"\")","v":""},null,{"$f":"M348*100/M1341","v":9.0942355516103461},{"$f":"IF(J348-J347=0,\"\",J348-J347)","v":-35},{"$f":"IF(K348-K347=0,\"\",K348-K347)","v":253},{"$f":"IF(L348-L347=0,\"\",L348-L347)","v":37},{"$f":"IF(M348-M347=0,\"\",M348-M347)","v":488},{"$f":"IF(N348-N347=0,\"\",N348-N347)","v":9244},{"$f":"IF(M348=0,0,H348/M348)","v":0.7933089933686015},{"$f":"IF(M348=0,0,K348/M348)","v":0.14760450040980552},{"$f":"IF(M348=0,0,L348/M348)","v":5.9086506221593026E-2},{"$f":"L348*100/B$1285","v":28021.20141342756}]
["2020-04-11T17:00:00",5,"Veneto",1465,251,1716,9033,10749,102,347,2188,831,13768,190912,{"$f":"IF(P349=\"x2\",M349,O348)","v":12933},{"$f":"IF(M349>O348*2,\"x2\",O348)","v":12933},{"$f":"IF(P349=\"x2\",M349,\"\")","v":""},null,{"$f":"M349*100/M1342","v":9.041774205199939},{"$f":"IF(J349-J348=0,\"\",J349-J348)","v":-141},{"$f":"IF(K349-K348=0,\"\",K349-K348)","v":207},{"$f":"IF(L349-L348=0,\"\",L349-L348)","v":38},{"$f":"IF(M349-M348=0,\"\",M349-M348)","v":347},{"$f":"IF(N349-N348=0,\"\",N349-N348)","v":10212},{"$f":"IF(M349=0,0,H349/M349)","v":0.78072341661824518},{"$f":"IF(M349=0,0,K349/M349)","v":0.15891923300406741},{"$f":"IF(M349=0,0,L349/M349)","v":6.0357350377687392E-2},{"$f":"L349*100/B$1285","v":29363.957597173143}]
["2020-04-12T17:00:00",5,"Veneto",1428,249,1677,9052,10729,-20,309,2492,856,14077,198442,{"$f":"IF(P350=\"x2\",M350,O349)","v":12933},{"$f":"IF(M350>O349*2,\"x2\",O349)","v":12933},{"$f":"IF(P350=\"x2\",M350,\"\")","v":""},null,{"$f":"M350*100/M1343","v":9.0027691973164998},{"$f":"IF(J350-J349=0,\"\",J350-J349)","v":-38},{"$f":"IF(K350-K349=0,\"\",K350-K349)","v":304},{"$f":"IF(L350-L349=0,\"\",L350-L349)","v":25},{"$f":"IF(M350-M349=0,\"\",M350-M349)","v":309},{"$f":"IF(N350-N349=0,\"\",N350-N349)","v":7530},{"$f":"IF(M350=0,0,H350/M350)","v":0.76216523406975922},{"$f":"IF(M350=0,0,K350/M350)","v":0.17702635504724018},{"$f":"IF(M350=0,0,L350/M350)","v":6.0808410883000638E-2},{"$f":"L350*100/B$1285","v":30247.349823321554}]
["2020-04-13T17:00:00",5,"Veneto",1427,245,1672,9094,10766,37,174,2603,882,14251,203077,{"$f":"IF(P351=\"x2\",M351,O350)","v":12933},{"$f":"IF(M351>O350*2,\"x2\",O350)","v":12933},{"$f":"IF(P351=\"x2\",M351,\"\")","v":""},null,{"$f":"M351*100/M1344","v":8.9339000476441228},{"$f":"IF(J351-J350=0,\"\",J351-J350)","v":-135},{"$f":"IF(K351-K350=0,\"\",K351-K350)","v":111},{"$f":"IF(L351-L350=0,\"\",L351-L350)","v":26},{"$f":"IF(M351-M350=0,\"\",M351-M350)","v":174},{"$f":"IF(N351-N350=0,\"\",N351-N350)","v":4635},{"$f":"IF(M351=0,0,H351/M351)","v":0.75545575749070237},{"$f":"IF(M351=0,0,K351/M351)","v":0.1826538488527121},{"$f":"IF(M351=0,0,L351/M351)","v":6.1890393656585503E-2},{"$f":"L351*100/B$1285","v":31166.077738515902}]
["2020-04-14T17:00:00",5,"Veneto",1427,233,1660,9076,10736,-30,181,2790,906,14432,208878,{"$f":"IF(P352=\"x2\",M352,O351)","v":12933},{"$f":"IF(M352>O351*2,\"x2\",O351)","v":12933},{"$f":"IF(P352=\"x2\",M352,\"\")","v":""},null,{"$f":"M352*100/M1345","v":8.8818866623996851},{"$f":"IF(J352-J351=0,\"\",J352-J351)","v":7},{"$f":"IF(K352-K351=0,\"\",K352-K351)","v":187},{"$f":"IF(L352-L351=0,\"\",L352-L351)","v":24},{"$f":"IF(M352-M351=0,\"\",M352-M351)","v":181},{"$f":"IF(N352-N351=0,\"\",N352-N351)","v":5801},{"$f":"IF(M352=0,0,H352/M352)","v":0.74390243902439024},{"$f":"IF(M352=0,0,K352/M352)","v":0.19332039911308205},{"$f":"IF(M352=0,0,L352/M352)","v":6.2777161862527714E-2},{"$f":"L352*100/B$1285","v":32014.134275618373}]
["2020-04-15T17:00:00",5,"Veneto",1402,219,1621,9168,10789,53,192,2895,940,14624,216344,{"$f":"IF(P353=\"x2\",M353,O352)","v":12933},{"$f":"IF(M353>O352*2,\"x2\",O352)","v":12933},{"$f":"IF(P353=\"x2\",M353,\"\")","v":""},null,{"$f":"M353*100/M1346","v":8.8547122400169531},{"$f":"IF(J353-J352=0,\"\",J353-J352)","v":11},{"$f":"IF(K353-K352=0,\"\",K353-K352)","v":105},{"$f":"IF(L353-L352=0,\"\",L353-L352)","v":34},{"$f":"IF(M353-M352=0,\"\",M353-M352)","v":192},{"$f":"IF(N353-N352=0,\"\",N353-N352)","v":7466},{"$f":"IF(M353=0,0,H353/M353)","v":0.73775984682713347},{"$f":"IF(M353=0,0,K353/M353)","v":0.19796225382932167},{"$f":"IF(M353=0,0,L353/M353)","v":6.4277899343544859E-2},{"$f":"L353*100/B$1285","v":33215.547703180215}]
[{"$f":"A353 + 1","v":"2020-04-16T17:00:00"},null,null,null,null,null,null,null,null,null,null,null,null,null,null,"Media x2",{"$f":"COUNT(M302:M353) / COUNT(Q302:Q353)","v":5.7777777777777777}]
[{"$f":"A354+1","v":"2020-04-17T17:00:00"}]
[{"$f":"A355+1","v":"2020-04-18T17:00:00"}]
[null,null,null,null,{"$f":"E353/$M353","v":1.4975382932166301E-2},null,null,{"$f":"H353/$M353","v":0.73775984682713347},null,null,{"$f":"K353/$M353","v":0.19796225382932167},{"$f":"L353/$M353","v":6.4277899343544859E-2},null,{"$f":"N353/$M353","v":14.793763676148796}]
[]
[]
[]
["Data","Codice","Regione","Ricoverati","Terap. Intens.","Ospedalizzati","Quarantena","Positivi","+ Positivi","Nuovi","Guariti","Deceduti","Totale","Tamponi",null,null,"x 2",null,"% su Tot.","+ Nuovi","+ Guariti","+ Deceduti","+ Totali","+ Tamponi","% Positivi","% Guariti","% Deceduti","P. Stimati"]
["2020-02-24T18:00:00",6,"Friuli Venezia Giulia",0,0,0,0,0,0,0,0,0,0,58,{"$f":"M362","v":0},null,{"$f":"M362","v":0},null,{"$f":"M362*100/M1295","v":0},null,null,null,null,null,{"$f":"IF(M362=0,0,H362/M362)","v":0},{"$f":"IF(M362=0,0,K362/M362)","v":0},{"$f":"IF(M362=0,0,L362/M362)","v":0},{"$f":"L362*100/B$1285","v":0}]
["2020-02-25T18:00:00",6,"Friuli Venezia Giulia",0,0,0,0,0,0,0,0,0,0,89,{"$f":"IF(P363=\"x2\",M363,O362)","v":0},{"$f":"IF(M363>O362*2,\"x2\",O362)","v":0},{"$f":"IF(P363=\"x2\",M363,\"\")","v":""},null,{"$f":"M363*100/M1296","v":0},{"$f":"IF(J363-J362=0,\"\",J363-J362)","v":""},{"$f":"IF(K363-K362=0,\"\",K363-K362)","v":""},{"$f":"IF(L363-L362=0,\"\",L363-L362)","v":""},{"$f":"IF(M363-M362=0,\"\",M363-M362)","v":""},{"$f":"IF(N363-N362=0,\"\",N363-N362)","v":31},0,0,0,{"$f":"L363*100/B$1285","v":0}]
["2020-02-26T18:00:00",6,"Friuli Venezia Giulia",0,0,0,0,0,0,0,0,0,0,114,0,0,"",null,{"$f":"M364*100/M1297","v":0},"","","","",25,0,0,0,{"$f":"L364*100/B$1285","v":0}]
["2020-02-27T18:00:00",6,"Friuli Venezia Giulia",0,0,0,0,0,0,0,0,0,0,141,0,0,"",null,{"$f":"M365*100/M1298","v":0},"","","","",27,0,0,0,{"$f":"L365*100/B$1285","v":0}]
["2020-02-28T18:00:00",6,"Friuli Venezia Giulia",0,0,0,0,0,0,0,0,0,0,169,0,0,"",null,{"$f":"M366*100/M1299","v":0},"","","","",28,0,0,0,{"$f":"L366*100/B$1285","v":0}]
["2020-02-29T17:00:00",6,"Friuli Venezia Giulia",0,0,0,0,0,0,0,0,0,0,189,0,0,"",null,{"$f":"M367*100/M1300","v":0},"","","","",20,0,0,0,{"$f":"L367*100/B$1285","v":0}]
["2020-03-01T17:00:00",6,"Friuli Venezia Giulia",0,0,0,6,6,6,6,0,0,6,243,6,"x2",6,null,{"$f":"M368*100/M1301","v":0.35419126328217237},6,"","",6,54,1,0,0,{"$f":"L368*100/B$1285","v":0}]
["2020-03-02T18:00:00",6,"Friuli Venezia Giulia",0,0,0,9,9,3,3,0,0,9,269,6,6,"",null,{"$f":"M369*100/M1302","v":0.44204322200392926},-3,"","",3,26,1,0,0,{"$f":"L369*100/B$1285","v":0}]
["2020-03-03T18:00:00",6,"Friuli Venezia Giulia",1,0,1,12,13,4,4,0,0,13,354,13,"x2",13,null,{"$f":"M370*100/M1303","v":0.51958433253397285},1,"","",4,85,1,0,0,{"$f":"L370*100/B$1285","v":0}]
["2020-03-04T17:00:00",6,"Friuli Venezia Giulia",3,0,3,15,18,5,5,0,0,18,376,13,13,"",null,{"$f":"M371*100/M1304","v":0.58271285205568146},1,"","",5,22,1,0,0,{"$f":"L371*100/B$1285","v":0}]
["2020-03-05T17:00:00",6,"Friuli Venezia Giulia",4,0,4,17,21,3,3,0,0,21,397,13,13,"",null,{"$f":"M372*100/M1305","v":0.54432348367029548},-2,"","",3,21,1,0,0,{"$f":"L372*100/B$1285","v":0}]
["2020-03-06T17:00:00",6,"Friuli Venezia Giulia",4,0,4,24,28,7,7,3,0,31,577,31,"x2",31,null,{"$f":"M373*100/M1306","v":0.66867989646246762},4,3,"",10,180,0.90322580645161288,9.6774193548387094E-2,0,{"$f":"L373*100/B$1285","v":0}]
["2020-03-07T18:00:00",6,"Friuli Venezia Giulia",7,1,8,31,39,11,11,3,0,42,577,31,31,"",null,{"$f":"M374*100/M1307","v":0.71392146863844974},4,"","",11,"",0.9285714285714286,7.1428571428571425E-2,0,{"$f":"L374*100/B$1285","v":0}]
["2020-03-08T18:00:00",6,"Friuli Venezia Giulia",7,1,8,45,53,14,14,3,1,57,997,31,31,"",null,{"$f":"M375*100/M1308","v":0.77288135593220342},3,"",1,15,420,0.92982456140350878,5.2631578947368418E-2,1.7543859649122806E-2,{"$f":"L375*100/B$1285","v":35.335689045936398}]
["2020-03-09T18:00:00",6,"Friuli Venezia Giulia",18,1,19,70,89,36,36,3,1,93,1344,93,"x2",93,null,{"$f":"M376*100/M1309","v":1.0139555167902312},22,"","",36,347,0.956989247311828,3.2258064516129031E-2,1.0752688172043012E-2,{"$f":"L376*100/B$1285","v":35.335689045936398}]
["2020-03-10T18:00:00",6,"Friuli Venezia Giulia",27,6,33,77,110,21,21,3,3,116,1602,93,93,"",null,{"$f":"M377*100/M1310","v":1.1429697507143561},-15,"",2,23,258,0.94827586206896552,2.5862068965517241E-2,2.5862068965517241E-2,{"$f":"L377*100/B$1285","v":106.00706713780919}]
["2020-03-11T17:00:00",6,"Friuli Venezia Giulia",16,5,21,89,110,0,0,10,6,126,2073,93,93,"",null,{"$f":"M378*100/M1311","v":1.0110736639383726},-21,7,3,10,471,0.87301587301587302,7.9365079365079361E-2,4.7619047619047616E-2,{"$f":"L378*100/B$1285","v":212.01413427561837}]
["2020-03-12T17:00:00",6,"Friuli Venezia Giulia",23,10,33,115,148,38,38,11,8,167,2604,93,93,"",null,{"$f":"M379*100/M1312","v":1.105008932706941},38,1,2,41,531,0.88622754491017963,6.5868263473053898E-2,4.790419161676647E-2,{"$f":"L379*100/B$1285","v":282.68551236749119}]
["2020-03-13T17:00:00",6,"Friuli Venezia Giulia",59,8,67,169,236,88,88,11,10,257,3149,257,"x2",257,null,{"$f":"M380*100/M1313","v":1.4552661381653453},50,"",2,90,545,0.91828793774319062,4.2801556420233464E-2,3.8910505836575876E-2,{"$f":"L380*100/B$1285","v":353.35689045936397}]
["2020-03-14T17:00:00",6,"Friuli Venezia Giulia",67,11,78,193,271,35,35,17,13,301,3376,257,257,"",null,{"$f":"M381*100/M1314","v":1.4226969797230231},-53,6,3,44,227,0.90033222591362128,5.647840531561462E-2,4.3189368770764118E-2,{"$f":"L381*100/B$1285","v":459.36395759717311}]
["2020-03-15T17:00:00",6,"Friuli Venezia Giulia",98,12,110,206,316,45,45,17,14,347,3407,257,257,"",null,{"$f":"M382*100/M1315","v":1.4021901644643795},10,"",1,46,31,0.91066282420749278,4.8991354466858789E-2,4.0345821325648415E-2,{"$f":"L382*100/B$1285","v":494.69964664310953}]
["2020-03-16T17:00:00",6,"Friuli Venezia Giulia",96,19,115,231,346,30,30,18,22,386,4851,257,257,"",null,{"$f":"M383*100/M1316","v":1.3795568263045033},-15,1,8,39,1444,0.89637305699481862,4.6632124352331605E-2,5.6994818652849742E-2,{"$f":"L383*100/B$1285","v":777.38515901060066}]
["2020-03-17T17:00:00",6,"Friuli Venezia Giulia",104,21,125,222,347,1,1,17,30,394,4958,257,257,"",null,{"$f":"M384*100/M1317","v":1.2505554497556022},-29,-1,8,8,107,0.88071065989847719,4.3147208121827409E-2,7.6142131979695438E-2,{"$f":"L384*100/B$1285","v":1060.0706713780919}]
["2020-03-18T17:00:00",6,"Friuli Venezia Giulia",128,27,155,261,416,69,69,15,31,462,4958,257,257,"",null,{"$f":"M385*100/M1318","v":1.2936465712765659},68,-2,1,68,"",0.90043290043290047,3.2467532467532464E-2,6.7099567099567103E-2,{"$f":"L385*100/B$1285","v":1095.4063604240282}]
["2020-03-19T17:00:00",6,"Friuli Venezia Giulia",134,29,163,359,522,106,106,41,36,599,4052,599,"x2",599,null,{"$f":"M386*100/M1319","v":1.4597294992079932},37,26,5,137,-906,0.87145242070116857,6.8447412353923209E-2,6.0100166944908183E-2,{"$f":"L386*100/B$1285","v":1272.0848056537102}]
["2020-03-20T17:00:00",6,"Friuli Venezia Giulia",143,32,175,380,555,33,33,63,38,656,4964,599,599,"",null,{"$f":"M387*100/M1320","v":1.3951213287679973},-73,22,2,57,{"$f":"IF(N387-N386=0,\"\",N387-N386)","v":912},0.84603658536585369,9.6036585365853661E-2,5.7926829268292686E-2,{"$f":"L387*100/B$1285","v":1342.756183745583}]
["2020-03-21T17:00:00",6,"Friuli Venezia Giulia",152,37,189,477,666,111,111,82,42,790,5955,599,599,"",null,{"$f":"M388*100/M1321","v":1.4744857964089739},78,19,4,{"$f":"IF(M388-M387=0,\"\",M388-M387)","v":134},991,0.84303797468354436,0.10379746835443038,5.3164556962025315E-2,{"$f":"L388*100/B$1285","v":1484.0989399293285}]
["2020-03-22T17:00:00",6,"Friuli Venezia Giulia",163,47,210,528,738,72,72,89,47,874,6761,599,599,"",null,{"$f":"M389*100/M1322","v":1.4778991511380162},-39,7,5,84,806,0.84439359267734548,0.10183066361556065,5.3775743707093822E-2,{"$f":"L389*100/B$1285","v":1660.7773851590105}]
["2020-03-23T17:00:00",6,"Friuli Venezia Giulia",185,41,226,545,771,33,33,105,54,930,7424,599,599,"",null,{"$f":"M390*100/M1323","v":1.4547843634145197},-39,16,7,56,663,0.82903225806451608,0.11290322580645161,5.8064516129032261E-2,{"$f":"L390*100/B$1285","v":1908.1272084805653}]
["2020-03-24T17:00:00",6,"Friuli Venezia Giulia",195,49,244,604,848,77,77,80,64,992,8526,599,599,"",null,{"$f":"M391*100/M1324","v":1.4340233607031341},44,-25,10,62,1102,0.85483870967741937,8.0645161290322578E-2,6.4516129032258063E-2,{"$f":"L391*100/B$1285","v":2261.4840989399295}]
["2020-03-25T17:00:00",6,"Friuli Venezia Giulia",200,52,252,659,911,63,63,158,70,1139,9494,599,599,"",null,{"$f":"M392*100/M1325","v":1.5312021079235341},-14,78,6,147,968,0.79982440737489024,0.13871817383669885,6.1457418788410885E-2,{"$f":"L392*100/B$1285","v":2473.4982332155478}]
["2020-03-26T17:00:00",6,"Friuli Venezia Giulia",212,54,266,688,954,43,43,197,72,1223,10721,1223,"x2",1223,null,{"$f":"M393*100/M1326","v":1.5185189783831436},-20,39,2,84,{"$f":"IF(N393-N392=0,\"\",N393-N392)","v":1227},0.78004905968928862,0.16107931316434995,5.8871627146361405E-2,{"$f":"L393*100/B$1285","v":2544.1696113074204}]
["2020-03-27T17:00:00",6,"Friuli Venezia Giulia",222,57,279,748,1027,73,94,214,76,1317,11841,{"$f":"IF(P394=\"x2\",M394,O393)","v":1223},{"$f":"IF(M394>O393*2,\"x2\",O393)","v":1223},{"$f":"IF(P394=\"x2\",M394,\"\")","v":""},null,{"$f":"M394*100/M1327","v":1.5225785567296353},{"$f":"IF(J394-J393=0,\"\",J394-J393)","v":51},17,4,94,1120,0.77980258162490512,0.1624905087319666,5.7706909643128322E-2,{"$f":"L394*100/B$1285","v":2685.5123674911661}]
["2020-03-28T17:00:00",6,"Friuli Venezia Giulia",223,59,282,838,1120,93,119,229,87,1436,12723,1223,1223,"",null,{"$f":"M395*100/M1328","v":1.5529025002162817},25,15,11,119,882,0.77994428969359331,0.1594707520891365,6.0584958217270196E-2,{"$f":"L395*100/B$1285","v":3074.2049469964663}]
["2020-03-29T17:00:00",6,"Friuli Venezia Giulia",236,60,296,845,1141,21,44,241,98,1480,13397,1223,1223,"",null,{"$f":"M396*100/M1329","v":1.5150119256006305},-75,12,11,44,674,0.7709459459459459,0.16283783783783784,6.621621621621622E-2,{"$f":"L396*100/B$1285","v":3462.8975265017666}]
["2020-03-30T17:00:00",6,"Friuli Venezia Giulia",229,60,289,820,1109,-32,21,285,107,1501,14003,1223,1223,"",null,{"$f":"M397*100/M1330","v":1.4753437718082545},-23,44,9,21,606,0.73884077281812122,0.189873417721519,7.1285809460359756E-2,{"$f":"L397*100/B$1285","v":3780.9187279151943}]
["2020-03-31T17:00:00",6,"Friuli Venezia Giulia",215,60,275,885,1160,51,92,320,113,1593,14899,1223,1223,"",null,{"$f":"M398*100/M1331","v":1.5057849364791289},71,35,6,92,896,0.72818581293157569,0.20087884494664154,7.0935342121782805E-2,{"$f":"L398*100/B$1285","v":3992.9328621908126}]
["2020-04-01T17:00:00",6,"Friuli Venezia Giulia",206,60,266,940,1206,46,92,357,122,1685,15987,1223,1223,"",null,{"$f":"M399*100/M1332","v":1.5238663700327382},"",37,9,92,{"$f":"IF(N399-N398=0,\"\",N399-N398)","v":1088},{"$f":"IF(M399=0,0,H399/M399)","v":0.71572700296735903},{"$f":"IF(M399=0,0,K399/M399)","v":0.21186943620178042},{"$f":"IF(M399=0,0,L399/M399)","v":7.2403560830860539E-2},{"$f":"L399*100/B$1285","v":4310.9540636042402}]
["2020-04-02T17:00:00",6,"Friuli Venezia Giulia",199,60,259,1035,1294,88,114,376,129,1799,17121,{"$f":"IF(P400=\"x2\",M400,O399)","v":1223},{"$f":"IF(M400>O399*2,\"x2\",O399)","v":1223},{"$f":"IF(P400=\"x2\",M400,\"\")","v":""},null,{"$f":"M400*100/M1333","v":1.5610628069627392},{"$f":"IF(J400-J399=0,\"\",J400-J399)","v":22},{"$f":"IF(K400-K399=0,\"\",K400-K399)","v":19},{"$f":"IF(L400-L399=0,\"\",L400-L399)","v":7},{"$f":"IF(M400-M399=0,\"\",M400-M399)","v":114},1134,0.71928849360755975,0.20900500277932185,7.1706503613118394E-2,{"$f":"L400*100/B$1285","v":4558.3038869257953}]
["2020-04-03T17:00:00",6,"Friuli Venezia Giulia",201,61,262,1062,1324,30,80,419,136,1879,19985,{"$f":"IF(P401=\"x2\",M401,O400)","v":1223},{"$f":"IF(M401>O400*2,\"x2\",O400)","v":1223},{"$f":"IF(P401=\"x2\",M401,\"\")","v":""},null,{"$f":"M401*100/M1334","v":1.5680940021864855},{"$f":"IF(J401-J400=0,\"\",J401-J400)","v":-34},{"$f":"IF(K401-K400=0,\"\",K401-K400)","v":43},{"$f":"IF(L401-L400=0,\"\",L401-L400)","v":7},{"$f":"IF(M401-M400=0,\"\",M401-M400)","v":80},2864,0.70463012240553491,0.22299095263437999,7.2378924960085148E-2,{"$f":"L401*100/B$1285","v":4805.6537102473494}]
["2020-04-04T17:00:00",6,"Friuli Venezia Giulia",183,50,233,1103,1336,12,107,505,145,1986,21126,{"$f":"IF(P402=\"x2\",M402,O401)","v":1223},{"$f":"IF(M402>O401*2,\"x2\",O401)","v":1223},{"$f":"IF(P402=\"x2\",M402,\"\")","v":""},null,{"$f":"M402*100/M1335","v":1.5934912382052764},{"$f":"IF(J402-J401=0,\"\",J402-J401)","v":27},{"$f":"IF(K402-K401=0,\"\",K402-K401)","v":86},{"$f":"IF(L402-L401=0,\"\",L402-L401)","v":9},{"$f":"IF(M402-M401=0,\"\",M402-M401)","v":107},1141,0.67270896273917424,0.25427995971802619,7.3011077542799591E-2,{"$f":"L402*100/B$1285","v":5123.6749116607771}]
["2020-04-05T17:00:00",6,"Friuli Venezia Giulia",185,50,235,1128,1363,27,62,531,154,2048,21652,{"$f":"IF(P403=\"x2\",M403,O402)","v":1223},{"$f":"IF(M403>O402*2,\"x2\",O402)","v":1223},{"$f":"IF(P403=\"x2\",M403,\"\")","v":""},null,{"$f":"M403*100/M1336","v":1.5882371188386015},{"$f":"IF(J403-J402=0,\"\",J403-J402)","v":-45},{"$f":"IF(K403-K402=0,\"\",K403-K402)","v":26},{"$f":"IF(L403-L402=0,\"\",L403-L402)","v":9},{"$f":"IF(M403-M402=0,\"\",M403-M402)","v":62},526,0.66552734375,0.25927734375,7.51953125E-2,{"$f":"L403*100/B$1285","v":5441.6961130742047}]
["2020-04-06T17:00:00",6,"Friuli Venezia Giulia",189,46,235,1161,1396,33,55,549,158,2103,22272,{"$f":"IF(P404=\"x2\",M404,O403)","v":1223},{"$f":"IF(M404>O403*2,\"x2\",O403)","v":1223},{"$f":"IF(P404=\"x2\",M404,\"\")","v":""},null,{"$f":"M404*100/M1337","v":1.586607014870197},{"$f":"IF(J404-J403=0,\"\",J404-J403)","v":-7},{"$f":"IF(K404-K403=0,\"\",K404-K403)","v":18},{"$f":"IF(L404-L403=0,\"\",L404-L403)","v":4},{"$f":"IF(M404-M403=0,\"\",M404-M403)","v":55},620,0.66381359961959108,0.26105563480741795,7.5130765572990962E-2,{"$f":"L404*100/B$1285","v":5583.03886925795}]
["2020-04-07T17:00:00",6,"Friuli Venezia Giulia",185,44,229,1150,1379,-17,50,610,164,2153,23536,{"$f":"IF(P405=\"x2\",M405,O404)","v":1223},{"$f":"IF(M405>O404*2,\"x2\",O404)","v":1223},{"$f":"IF(P405=\"x2\",M405,\"\")","v":""},null,{"$f":"M405*100/M1338","v":1.5879220568495271},{"$f":"IF(J405-J404=0,\"\",J405-J404)","v":-5},{"$f":"IF(K405-K404=0,\"\",K405-K404)","v":61},{"$f":"IF(L405-L404=0,\"\",L405-L404)","v":6},{"$f":"IF(M405-M404=0,\"\",M405-M404)","v":50},{"$f":"IF(N405-N404=0,\"\",N405-N404)","v":1264},{"$f":"IF(M405=0,0,H405/M405)","v":0.64050162563864377},{"$f":"IF(M405=0,0,K405/M405)","v":0.28332559219693448},{"$f":"IF(M405=0,0,L405/M405)","v":7.6172782164421735E-2},{"$f":"L405*100/B$1285","v":5795.0530035335687}]
["2020-04-08T17:00:00",6,"Friuli Venezia Giulia",162,41,203,1212,1415,36,65,634,169,2218,24798,{"$f":"IF(P406=\"x2\",M406,O405)","v":1223},{"$f":"IF(M406>O405*2,\"x2\",O405)","v":1223},{"$f":"IF(P406=\"x2\",M406,\"\")","v":""},null,{"$f":"M406*100/M1339","v":1.590853667283499},{"$f":"IF(J406-J405=0,\"\",J406-J405)","v":15},{"$f":"IF(K406-K405=0,\"\",K406-K405)","v":24},{"$f":"IF(L406-L405=0,\"\",L406-L405)","v":5},{"$f":"IF(M406-M405=0,\"\",M406-M405)","v":65},{"$f":"IF(N406-N405=0,\"\",N406-N405)","v":1262},{"$f":"IF(M406=0,0,H406/M406)","v":0.63796212804328223},{"$f":"IF(M406=0,0,K406/M406)","v":0.28584310189359785},{"$f":"IF(M406=0,0,L406/M406)","v":7.6194770063119921E-2},{"$f":"L406*100/B$1285","v":5971.7314487632511}]
["2020-04-09T17:00:00",6,"Friuli Venezia Giulia",167,37,204,1186,1390,-25,81,738,171,2299,26205,{"$f":"IF(P407=\"x2\",M407,O406)","v":1223},{"$f":"IF(M407>O406*2,\"x2\",O406)","v":1223},{"$f":"IF(P407=\"x2\",M407,\"\")","v":""},null,{"$f":"M407*100/M1340","v":1.600685112723323},{"$f":"IF(J407-J406=0,\"\",J407-J406)","v":16},{"$f":"IF(K407-K406=0,\"\",K407-K406)","v":104},{"$f":"IF(L407-L406=0,\"\",L407-L406)","v":2},{"$f":"IF(M407-M406=0,\"\",M407-M406)","v":81},{"$f":"IF(N407-N406=0,\"\",N407-N406)","v":1407},{"$f":"IF(M407=0,0,H407/M407)","v":0.60461070030448016},{"$f":"IF(M407=0,0,K407/M407)","v":0.32100913440626361},{"$f":"IF(M407=0,0,L407/M407)","v":7.43801652892562E-2},{"$f":"L407*100/B$1285","v":6042.4028268551237}]
["2020-04-10T17:00:00",6,"Friuli Venezia Giulia",167,33,200,1198,1398,8,50,772,179,2349,28097,{"$f":"IF(P408=\"x2\",M408,O407)","v":1223},{"$f":"IF(M408>O407*2,\"x2\",O407)","v":1223},{"$f":"IF(P408=\"x2\",M408,\"\")","v":""},null,{"$f":"M408*100/M1341","v":1.5917114455504584},{"$f":"IF(J408-J407=0,\"\",J408-J407)","v":-31},{"$f":"IF(K408-K407=0,\"\",K408-K407)","v":34},{"$f":"IF(L408-L407=0,\"\",L408-L407)","v":8},{"$f":"IF(M408-M407=0,\"\",M408-M407)","v":50},{"$f":"IF(N408-N407=0,\"\",N408-N407)","v":1892},{"$f":"IF(M408=0,0,H408/M408)","v":0.59514687100893993},{"$f":"IF(M408=0,0,K408/M408)","v":0.32865048957002979},{"$f":"IF(M408=0,0,L408/M408)","v":7.6202639421030227E-2},{"$f":"L408*100/B$1285","v":6325.0883392226151}]
["2020-04-11T17:00:00",6,"Friuli Venezia Giulia",172,28,200,1182,1382,-16,44,826,185,2393,29685,{"$f":"IF(P409=\"x2\",M409,O408)","v":1223},{"$f":"IF(M409>O408*2,\"x2\",O408)","v":1223},{"$f":"IF(P409=\"x2\",M409,\"\")","v":""},null,{"$f":"M409*100/M1342","v":1.5715402144860151},{"$f":"IF(J409-J408=0,\"\",J409-J408)","v":-6},{"$f":"IF(K409-K408=0,\"\",K409-K408)","v":54},{"$f":"IF(L409-L408=0,\"\",L409-L408)","v":6},{"$f":"IF(M409-M408=0,\"\",M409-M408)","v":44},{"$f":"IF(N409-N408=0,\"\",N409-N408)","v":1588},{"$f":"IF(M409=0,0,H409/M409)","v":0.57751776013372336},{"$f":"IF(M409=0,0,K409/M409)","v":0.34517342248223987},{"$f":"IF(M409=0,0,L409/M409)","v":7.7308817384036776E-2},{"$f":"L409*100/B$1285","v":6537.1024734982329}]
["2020-04-12T17:00:00",6,"Friuli Venezia Giulia",160,28,188,1138,1326,-56,38,910,195,2431,29988,{"$f":"IF(P410=\"x2\",M410,O409)","v":1223},{"$f":"IF(M410>O409*2,\"x2\",O409)","v":1223},{"$f":"IF(P410=\"x2\",M410,\"\")","v":""},null,{"$f":"M410*100/M1343","v":1.5547156296566322},{"$f":"IF(J410-J409=0,\"\",J410-J409)","v":-6},{"$f":"IF(K410-K409=0,\"\",K410-K409)","v":84},{"$f":"IF(L410-L409=0,\"\",L410-L409)","v":10},{"$f":"IF(M410-M409=0,\"\",M410-M409)","v":38},{"$f":"IF(N410-N409=0,\"\",N410-N409)","v":303},{"$f":"IF(M410=0,0,H410/M410)","v":0.54545454545454541},{"$f":"IF(M410=0,0,K410/M410)","v":0.37433155080213903},{"$f":"IF(M410=0,0,L410/M410)","v":8.0213903743315509E-2},{"$f":"L410*100/B$1285","v":6890.4593639575969}]
["2020-04-13T17:00:00",6,"Friuli Venezia Giulia",159,30,189,1118,1307,-19,51,973,202,2482,30941,{"$f":"IF(P411=\"x2\",M411,O410)","v":2482},{"$f":"IF(M411>O410*2,\"x2\",O410)","v":"x2"},{"$f":"IF(P411=\"x2\",M411,\"\")","v":2482},null,{"$f":"M411*100/M1344","v":1.5559567692269114},{"$f":"IF(J411-J410=0,\"\",J411-J410)","v":13},{"$f":"IF(K411-K410=0,\"\",K411-K410)","v":63},{"$f":"IF(L411-L410=0,\"\",L411-L410)","v":7},{"$f":"IF(M411-M410=0,\"\",M411-M410)","v":51},{"$f":"IF(N411-N410=0,\"\",N411-N410)","v":953},{"$f":"IF(M411=0,0,H411/M411)","v":0.5265914585012087},{"$f":"IF(M411=0,0,K411/M411)","v":0.3920225624496374},{"$f":"IF(M411=0,0,L411/M411)","v":8.1385979049153914E-2},{"$f":"L411*100/B$1285","v":7137.809187279152}]
["2020-04-14T17:00:00",6,"Friuli Venezia Giulia",166,28,194,705,899,-408,38,1415,206,2520,31764,{"$f":"IF(P412=\"x2\",M412,O411)","v":2482},{"$f":"IF(M412>O411*2,\"x2\",O411)","v":2482},{"$f":"IF(P412=\"x2\",M412,\"\")","v":""},null,{"$f":"M412*100/M1345","v":1.5508837575697898},{"$f":"IF(J412-J411=0,\"\",J412-J411)","v":-13},{"$f":"IF(K412-K411=0,\"\",K412-K411)","v":442},{"$f":"IF(L412-L411=0,\"\",L412-L411)","v":4},{"$f":"IF(M412-M411=0,\"\",M412-M411)","v":38},{"$f":"IF(N412-N411=0,\"\",N412-N411)","v":823},{"$f":"IF(M412=0,0,H412/M412)","v":0.35674603174603176},{"$f":"IF(M412=0,0,K412/M412)","v":0.56150793650793651},{"$f":"IF(M412=0,0,L412/M412)","v":8.1746031746031747E-2},{"$f":"L412*100/B$1285","v":7279.1519434628972}]
["2020-04-15T17:00:00",6,"Friuli Venezia Giulia",163,24,187,1207,1394,495,24,938,212,2544,33800,{"$f":"IF(P413=\"x2\",M413,O412)","v":2482},{"$f":"IF(M413>O412*2,\"x2\",O412)","v":2482},{"$f":"IF(P413=\"x2\",M413,\"\")","v":""},null,{"$f":"M413*100/M1346","v":1.5403711664799733},{"$f":"IF(J413-J412=0,\"\",J413-J412)","v":-14},{"$f":"IF(K413-K412=0,\"\",K413-K412)","v":-477},{"$f":"IF(L413-L412=0,\"\",L413-L412)","v":6},{"$f":"IF(M413-M412=0,\"\",M413-M412)","v":24},{"$f":"IF(N413-N412=0,\"\",N413-N412)","v":2036},{"$f":"IF(M413=0,0,H413/M413)","v":0.54795597484276726},{"$f":"IF(M413=0,0,K413/M413)","v":0.36871069182389937},{"$f":"IF(M413=0,0,L413/M413)","v":8.3333333333333329E-2},{"$f":"L413*100/B$1285","v":7491.1660777385159}]
[{"$f":"A413 + 1","v":"2020-04-16T17:00:00"},null,null,null,null,null,null,null,null,null,null,null,null,null,null,"Media x2",{"$f":"COUNT(M362:M413) / COUNT(Q362:Q413)","v":5.7777777777777777}]
[{"$f":"A414+1","v":"2020-04-17T17:00:00"}]
[{"$f":"A415+1","v":"2020-04-18T17:00:00"}]
[null,null,null,null,{"$f":"E413/$M413","v":9.433962264150943E-3},null,null,{"$f":"H413/$M413","v":0.54795597484276726},null,null,{"$f":"K413/$M413","v":0.36871069182389937},{"$f":"L413/$M413","v":8.3333333333333329E-2},null,{"$f":"N413/$M413","v":13.286163522012579}]
[]
[]
[]
["Data","Codice","Regione","Ricoverati","Terap. Intens.","Ospedalizzati","Quarantena","Positivi","+ Positivi","Nuovi","Guariti","Deceduti","Totale","Tamponi",null,null,"x 2",null,"% su Tot.","+ Nuovi","+ Guariti","+ Deceduti","+ Totali","+ Tamponi","% Positivi","% Guariti","% Deceduti","P. Stimati"]
["2020-02-24T18:00:00",7,"Liguria",0,0,0,0,0,0,0,0,0,0,1,{"$f":"M422","v":0},null,{"$f":"M422","v":0},null,{"$f":"M422*100/M1295","v":0},null,null,null,null,null,{"$f":"IF(M422=0,0,H422/M422)","v":0},{"$f":"IF(M422=0,0,K422/M422)","v":0},{"$f":"IF(M422=0,0,L422/M422)","v":0},{"$f":"L422*100/B$1285","v":0}]
["2020-02-25T18:00:00",7,"Liguria",1,0,1,0,1,1,1,0,0,1,39,{"$f":"IF(P423=\"x2\",M423,O422)","v":1},{"$f":"IF(M423>O422*2,\"x2\",O422)","v":"x2"},{"$f":"IF(P423=\"x2\",M423,\"\")","v":1},null,{"$f":"M423*100/M1296","v":0.3105590062111801},{"$f":"IF(J423-J422=0,\"\",J423-J422)","v":1},{"$f":"IF(K423-K422=0,\"\",K423-K422)","v":""},{"$f":"IF(L423-L422=0,\"\",L423-L422)","v":""},{"$f":"IF(M423-M422=0,\"\",M423-M422)","v":1},{"$f":"IF(N423-N422=0,\"\",N423-N422)","v":38},1,0,0,{"$f":"L423*100/B$1285","v":0}]
["2020-02-26T18:00:00",7,"Liguria",6,0,6,5,11,10,10,0,0,11,66,11,"x2",11,null,{"$f":"M424*100/M1297","v":2.75},9,"","",10,27,1,0,0,{"$f":"L424*100/B$1285","v":0}]
["2020-02-27T18:00:00",7,"Liguria",9,0,9,10,19,8,8,0,0,19,78,11,11,"",null,{"$f":"M425*100/M1298","v":2.9230769230769229},-2,"","",8,12,1,0,0,{"$f":"L425*100/B$1285","v":0}]
["2020-02-28T18:00:00",7,"Liguria",9,0,9,10,19,0,0,0,0,19,112,11,11,"",null,{"$f":"M426*100/M1299","v":2.1396396396396398},-8,"","","",34,1,0,0,{"$f":"L426*100/B$1285","v":0}]
["2020-02-29T17:00:00",7,"Liguria",4,1,5,33,38,19,19,4,0,42,121,42,"x2",42,null,{"$f":"M427*100/M1300","v":3.7234042553191489},19,4,"",23,9,0.90476190476190477,9.5238095238095233E-2,0,{"$f":"L427*100/B$1285","v":0}]
["2020-03-01T17:00:00",7,"Liguria",12,1,13,8,21,-17,-17,4,0,25,121,42,42,"",null,{"$f":"M428*100/M1301","v":1.4757969303423848},-36,"","",-17,"",0.84,0.16,0,{"$f":"L428*100/B$1285","v":0}]
["2020-03-02T18:00:00",7,"Liguria",12,1,13,5,18,-3,-3,4,0,22,121,42,42,"",null,{"$f":"M429*100/M1302","v":1.080550098231827},14,"","",-3,"",0.81818181818181823,0.18181818181818182,0,{"$f":"L429*100/B$1285","v":0}]
["2020-03-03T18:00:00",7,"Liguria",12,2,14,5,19,1,1,4,1,24,121,42,42,"",null,{"$f":"M430*100/M1303","v":0.95923261390887293},4,"",1,2,"",0.79166666666666663,0.16666666666666666,4.1666666666666664E-2,{"$f":"L430*100/B$1285","v":35.335689045936398}]
["2020-03-04T17:00:00",7,"Liguria",10,3,13,8,21,2,2,4,1,26,133,42,42,"",null,{"$f":"M431*100/M1304","v":0.84169634185820652},1,"","",2,12,0.80769230769230771,0.15384615384615385,3.8461538461538464E-2,{"$f":"L431*100/B$1285","v":35.335689045936398}]
["2020-03-05T17:00:00",7,"Liguria",11,3,14,7,21,0,0,4,3,28,146,42,42,"",null,{"$f":"M432*100/M1305","v":0.72576464489372727},-2,"",2,2,13,0.75,0.14285714285714285,0.10714285714285714,{"$f":"L432*100/B$1285","v":106.00706713780919}]
["2020-03-06T17:00:00",7,"Liguria",12,5,17,7,24,3,3,5,3,32,229,42,42,"",null,{"$f":"M433*100/M1306","v":0.69025021570319245},3,1,"",4,83,0.75,0.15625,9.375E-2,{"$f":"L433*100/B$1285","v":106.00706713780919}]
["2020-03-07T18:00:00",7,"Liguria",26,6,32,10,42,18,18,5,4,51,331,42,42,"",null,{"$f":"M434*100/M1307","v":0.86690464048954619},15,"",1,19,102,0.82352941176470584,9.8039215686274508E-2,7.8431372549019607E-2,{"$f":"L434*100/B$1285","v":141.34275618374559}]
["2020-03-08T18:00:00",7,"Liguria",39,11,50,17,67,25,25,5,6,78,401,42,42,"",null,{"$f":"M435*100/M1308","v":1.0576271186440678},7,"",2,27,70,0.85897435897435892,6.4102564102564097E-2,7.6923076923076927E-2,{"$f":"L435*100/B$1285","v":212.01413427561837}]
["2020-03-09T18:00:00",7,"Liguria",60,17,77,20,97,30,30,5,7,109,611,109,"x2",109,null,{"$f":"M436*100/M1309","v":1.1883994766681203},5,"",1,31,210,0.88990825688073394,4.5871559633027525E-2,6.4220183486238536E-2,{"$f":"L436*100/B$1285","v":247.34982332155477}]
["2020-03-10T18:00:00",7,"Liguria",57,29,86,42,128,31,31,5,8,141,694,109,109,"",null,{"$f":"M437*100/M1310","v":1.3892994383683122},1,"",1,32,83,0.90780141843971629,3.5460992907801421E-2,5.6737588652482268E-2,{"$f":"L437*100/B$1285","v":282.68551236749119}]
["2020-03-11T17:00:00",7,"Liguria",74,34,108,73,181,53,53,5,8,194,1025,109,109,"",null,{"$f":"M438*100/M1311","v":1.5567324666987643},22,"","",53,331,0.9329896907216495,2.5773195876288658E-2,4.1237113402061855E-2,{"$f":"L438*100/B$1285","v":282.68551236749119}]
["2020-03-12T17:00:00",7,"Liguria",100,36,136,107,243,62,62,20,11,274,1174,274,"x2",274,null,{"$f":"M439*100/M1312","v":1.8130086680341428},9,15,3,80,149,0.88686131386861311,7.2992700729927001E-2,4.0145985401459854E-2,{"$f":"L439*100/B$1285","v":388.69257950530033}]
["2020-03-13T17:00:00",7,"Liguria",128,44,172,132,304,61,61,24,17,345,1442,274,274,"",null,{"$f":"M440*100/M1313","v":1.9535673839184597},-1,4,6,71,268,0.88115942028985506,6.9565217391304349E-2,4.9275362318840582E-2,{"$f":"L440*100/B$1285","v":600.70671378091868}]
["2020-03-14T17:00:00",7,"Liguria",213,62,275,109,384,80,80,52,27,463,1750,274,274,"",null,{"$f":"M441*100/M1314","v":2.1884010020324243},19,28,10,118,308,0.82937365010799136,0.11231101511879049,5.8315334773218146E-2,{"$f":"L441*100/B$1285","v":954.06360424028264}]
["2020-03-15T17:00:00",7,"Liguria",253,66,319,174,493,109,109,33,33,559,1973,559,"x2",559,null,{"$f":"M442*100/M1315","v":2.2588596597567383},29,-19,6,96,223,0.88193202146690519,5.9033989266547404E-2,5.9033989266547404E-2,{"$f":"L442*100/B$1285","v":1166.077738515901}]
["2020-03-16T17:00:00",7,"Liguria",255,73,328,247,575,82,82,42,50,667,2189,559,559,"",null,{"$f":"M443*100/M1316","v":2.3838456040028593},-27,9,17,108,216,0.86206896551724133,6.296851574212893E-2,7.4962518740629688E-2,{"$f":"L443*100/B$1285","v":1766.7844522968198}]
["2020-03-17T17:00:00",7,"Liguria",299,85,384,277,661,86,86,57,60,778,2509,559,559,"",null,{"$f":"M444*100/M1317","v":2.4693709134767983},4,15,10,111,320,0.84961439588688947,7.3264781491002573E-2,7.7120822622107968E-2,{"$f":"L444*100/B$1285","v":2120.1413427561838}]
["2020-03-18T17:00:00",7,"Liguria",401,100,501,243,744,83,83,70,73,887,2912,559,559,"",null,{"$f":"M445*100/M1318","v":2.4836894128188614},-3,13,13,109,403,0.83878241262683206,7.8917700112739575E-2,8.2299887260428417E-2,{"$f":"L445*100/B$1285","v":2579.5053003533567}]
["2020-03-19T17:00:00",7,"Liguria",491,112,603,280,883,139,139,85,91,1059,3348,559,559,"",null,{"$f":"M446*100/M1319","v":2.5807237723894239},56,15,18,172,436,0.83380547686496698,8.0264400377714831E-2,8.593012275731822E-2,{"$f":"L446*100/B$1285","v":3215.547703180212}]
["2020-03-20T17:00:00",7,"Liguria",573,121,694,307,1001,118,118,101,119,1221,3794,1221,"x2",1221,null,{"$f":"M447*100/M1320","v":2.5967121073562875},-21,16,28,162,{"$f":"IF(N447-N446=0,\"\",N447-N446)","v":446},0.81981981981981977,8.2719082719082723E-2,9.7461097461097462E-2,{"$f":"L447*100/B$1285","v":4204.9469964664313}]
["2020-03-21T17:00:00",7,"Liguria",598,129,727,432,1159,158,158,125,152,1436,4304,1221,1221,"",null,{"$f":"M448*100/M1321","v":2.6802045615737802},40,24,33,{"$f":"IF(M448-M447=0,\"\",M448-M447)","v":215},510,0.80710306406685239,8.7047353760445687E-2,0.10584958217270195,{"$f":"L448*100/B$1285","v":5371.0247349823321}]
["2020-03-22T17:00:00",7,"Liguria",736,132,868,483,1351,192,192,143,171,1665,4995,1221,1221,"",null,{"$f":"M449*100/M1322","v":2.8154486117217354},34,18,19,229,691,0.81141141141141138,8.5885885885885888E-2,0.10270270270270271,{"$f":"L449*100/B$1285","v":6042.4028268551237}]
["2020-03-23T17:00:00",7,"Liguria",761,133,894,659,1553,202,202,159,212,1924,5538,1221,1221,"",null,{"$f":"M450*100/M1323","v":3.009682919580146},10,16,41,259,543,0.8071725571725572,8.2640332640332645E-2,0.11018711018711019,{"$f":"L450*100/B$1285","v":7491.1660777385159}]
["2020-03-24T17:00:00",7,"Liguria",803,147,950,742,1692,139,139,193,231,2116,5992,1221,1221,"",null,{"$f":"M451*100/M1324","v":3.0588643460159592},-63,34,19,192,454,0.79962192816635158,9.1209829867674855E-2,0.10916824196597354,{"$f":"L451*100/B$1285","v":8162.5441696113076}]
["2020-03-25T17:00:00",7,"Liguria",927,147,1074,752,1826,134,134,225,254,2305,6602,1221,1221,"",null,{"$f":"M452*100/M1325","v":3.0987013685370903},-5,32,23,189,610,0.79219088937093274,9.7613882863340565E-2,0.11019522776572668,{"$f":"L452*100/B$1285","v":8975.2650176678435}]
["2020-03-26T17:00:00",7,"Liguria",998,154,1152,875,2027,201,201,260,280,2567,7304,2567,"x2",2567,null,{"$f":"M453*100/M1326","v":3.1872757297706702},67,35,26,262,{"$f":"IF(N453-N452=0,\"\",N453-N452)","v":702},0.78963770938839106,0.10128554733151539,0.10907674328009349,{"$f":"L453*100/B$1285","v":9893.9929328621911}]
["2020-03-27T17:00:00",7,"Liguria",1023,157,1180,880,2060,33,129,305,331,2696,7804,{"$f":"IF(P454=\"x2\",M454,O453)","v":2567},{"$f":"IF(M454>O453*2,\"x2\",O453)","v":2567},{"$f":"IF(P454=\"x2\",M454,\"\")","v":""},null,{"$f":"M454*100/M1327","v":3.116835071331129},{"$f":"IF(J454-J453=0,\"\",J454-J453)","v":-72},45,51,129,500,0.76409495548961426,0.11313056379821959,0.12277448071216618,{"$f":"L454*100/B$1285","v":11696.113074204946}]
["2020-03-28T17:00:00",7,"Liguria",1031,167,1198,888,2086,26,126,378,358,2822,8177,2567,2567,"",null,{"$f":"M455*100/M1328","v":3.0517345791158403},-3,73,27,126,373,0.73919206236711554,0.13394755492558469,0.1268603827072998,{"$f":"L455*100/B$1285","v":12650.17667844523}]
["2020-03-29T17:00:00",7,"Liguria",1077,166,1243,1036,2279,193,254,420,377,3076,9100,2567,2567,"",null,{"$f":"M456*100/M1329","v":3.148768029153743},128,42,19,254,923,0.74089726918075427,0.13654096228868662,0.12256176853055917,{"$f":"L456*100/B$1285","v":13321.55477031802}]
["2020-03-30T17:00:00",7,"Liguria",1142,175,1317,1066,2383,104,141,437,397,3217,9677,2567,2567,"",null,{"$f":"M457*100/M1330","v":3.162012600870856},-113,17,20,141,577,0.74075225365247122,0.1358408455082375,0.12340690083929126,{"$f":"L457*100/B$1285","v":14028.268551236748}]
["2020-03-31T17:00:00",7,"Liguria",1153,179,1332,1176,2508,125,199,480,428,3416,10376,2567,2567,"",null,{"$f":"M458*100/M1331","v":3.2289776164549306},58,43,31,199,699,0.73419203747072603,0.14051522248243559,0.12529274004683841,{"$f":"L458*100/B$1285","v":15123.674911660777}]
["2020-04-01T17:00:00",7,"Liguria",1114,179,1293,1352,2645,137,244,555,460,3660,11334,2567,2567,"",null,{"$f":"M459*100/M1332","v":3.3100005426230399},45,75,32,244,{"$f":"IF(N459-N458=0,\"\",N459-N458)","v":958},{"$f":"IF(M459=0,0,H459/M459)","v":0.72267759562841527},{"$f":"IF(M459=0,0,K459/M459)","v":0.15163934426229508},{"$f":"IF(M459=0,0,L459/M459)","v":0.12568306010928962},{"$f":"L459*100/B$1285","v":16254.416961130742}]
["2020-04-02T17:00:00",7,"Liguria",1120,172,1292,1368,2660,15,122,634,488,3782,12069,{"$f":"IF(P460=\"x2\",M460,O459)","v":2567},{"$f":"IF(M460>O459*2,\"x2\",O459)","v":2567},{"$f":"IF(P460=\"x2\",M460,\"\")","v":""},null,{"$f":"M460*100/M1333","v":3.2817896253102168},{"$f":"IF(J460-J459=0,\"\",J460-J459)","v":-122},{"$f":"IF(K460-K459=0,\"\",K460-K459)","v":79},{"$f":"IF(L460-L459=0,\"\",L460-L459)","v":28},{"$f":"IF(M460-M459=0,\"\",M460-M459)","v":122},735,0.70333157059756746,0.16763617133791645,0.12903225806451613,{"$f":"L460*100/B$1285","v":17243.816254416961}]
["2020-04-03T17:00:00",7,"Liguria",1147,173,1320,1426,2746,86,183,700,519,3965,12934,{"$f":"IF(P461=\"x2\",M461,O460)","v":2567},{"$f":"IF(M461>O460*2,\"x2\",O460)","v":2567},{"$f":"IF(P461=\"x2\",M461,\"\")","v":""},null,{"$f":"M461*100/M1334","v":3.3089370509150693},{"$f":"IF(J461-J460=0,\"\",J461-J460)","v":61},{"$f":"IF(K461-K460=0,\"\",K461-K460)","v":66},{"$f":"IF(L461-L460=0,\"\",L461-L460)","v":31},{"$f":"IF(M461-M460=0,\"\",M461-M460)","v":183},865,0.69255989911727611,0.17654476670870115,0.13089533417402269,{"$f":"L461*100/B$1285","v":18339.22261484099}]
["2020-04-04T17:00:00",7,"Liguria",1121,169,1290,1604,2894,148,238,767,542,4203,14087,{"$f":"IF(P462=\"x2\",M462,O461)","v":2567},{"$f":"IF(M462>O461*2,\"x2\",O461)","v":2567},{"$f":"IF(P462=\"x2\",M462,\"\")","v":""},null,{"$f":"M462*100/M1335","v":3.3723281340265743},{"$f":"IF(J462-J461=0,\"\",J462-J461)","v":55},{"$f":"IF(K462-K461=0,\"\",K462-K461)","v":67},{"$f":"IF(L462-L461=0,\"\",L462-L461)","v":23},{"$f":"IF(M462-M461=0,\"\",M462-M461)","v":238},1153,0.68855579348084706,0.18248869854865571,0.12895550797049726,{"$f":"L462*100/B$1285","v":19151.943462897525}]
["2020-04-05T17:00:00",7,"Liguria",1126,165,1291,1802,3093,199,246,800,556,4449,15047,{"$f":"IF(P463=\"x2\",M463,O462)","v":2567},{"$f":"IF(M463>O462*2,\"x2\",O462)","v":2567},{"$f":"IF(P463=\"x2\",M463,\"\")","v":""},null,{"$f":"M463*100/M1336","v":3.4502279988832707},{"$f":"IF(J463-J462=0,\"\",J463-J462)","v":8},{"$f":"IF(K463-K462=0,\"\",K463-K462)","v":33},{"$f":"IF(L463-L462=0,\"\",L463-L462)","v":14},{"$f":"IF(M463-M462=0,\"\",M463-M462)","v":246},960,0.69521240728253542,0.17981568891885816,0.12497190379860643,{"$f":"L463*100/B$1285","v":19646.643109540637}]
["2020-04-06T17:00:00",7,"Liguria",1141,162,1303,1814,3117,24,100,837,595,4549,15533,{"$f":"IF(P464=\"x2\",M464,O463)","v":2567},{"$f":"IF(M464>O463*2,\"x2\",O463)","v":2567},{"$f":"IF(P464=\"x2\",M464,\"\")","v":""},null,{"$f":"M464*100/M1337","v":3.4319901619802788},{"$f":"IF(J464-J463=0,\"\",J464-J463)","v":-146},{"$f":"IF(K464-K463=0,\"\",K464-K463)","v":37},{"$f":"IF(L464-L463=0,\"\",L464-L463)","v":39},{"$f":"IF(M464-M463=0,\"\",M464-M463)","v":100},486,0.68520553967905029,0.18399648274346009,0.13079797757748957,{"$f":"L464*100/B$1285","v":21024.734982332157}]
["2020-04-07T17:00:00",7,"Liguria",1090,156,1246,1966,3212,95,208,925,620,4757,16579,{"$f":"IF(P465=\"x2\",M465,O464)","v":2567},{"$f":"IF(M465>O464*2,\"x2\",O464)","v":2567},{"$f":"IF(P465=\"x2\",M465,\"\")","v":""},null,{"$f":"M465*100/M1338","v":3.5084743262578733},{"$f":"IF(J465-J464=0,\"\",J465-J464)","v":108},{"$f":"IF(K465-K464=0,\"\",K465-K464)","v":88},{"$f":"IF(L465-L464=0,\"\",L465-L464)","v":25},{"$f":"IF(M465-M464=0,\"\",M465-M464)","v":208},{"$f":"IF(N465-N464=0,\"\",N465-N464)","v":1046},{"$f":"IF(M465=0,0,H465/M465)","v":0.67521547193609421},{"$f":"IF(M465=0,0,K465/M465)","v":0.19445028379230608},{"$f":"IF(M465=0,0,L465/M465)","v":0.13033424427159976},{"$f":"L465*100/B$1285","v":21908.127208480564}]
["2020-04-08T17:00:00",7,"Liguria",1109,153,1262,1983,3245,33,149,1007,654,4906,17521,{"$f":"IF(P466=\"x2\",M466,O465)","v":2567},{"$f":"IF(M466>O465*2,\"x2\",O465)","v":2567},{"$f":"IF(P466=\"x2\",M466,\"\")","v":""},null,{"$f":"M466*100/M1339","v":3.5188133866965043},{"$f":"IF(J466-J465=0,\"\",J466-J465)","v":-59},{"$f":"IF(K466-K465=0,\"\",K466-K465)","v":82},{"$f":"IF(L466-L465=0,\"\",L466-L465)","v":34},{"$f":"IF(M466-M465=0,\"\",M466-M465)","v":149},{"$f":"IF(N466-N465=0,\"\",N466-N465)","v":942},{"$f":"IF(M466=0,0,H466/M466)","v":0.66143497757847536},{"$f":"IF(M466=0,0,K466/M466)","v":0.20525886669384427},{"$f":"IF(M466=0,0,L466/M466)","v":0.1333061557276804},{"$f":"L466*100/B$1285","v":23109.540636042402}]
["2020-04-09T17:00:00",7,"Liguria",1103,154,1257,1996,3253,8,114,1085,682,5020,18446,{"$f":"IF(P467=\"x2\",M467,O466)","v":2567},{"$f":"IF(M467>O466*2,\"x2\",O466)","v":2567},{"$f":"IF(P467=\"x2\",M467,\"\")","v":""},null,{"$f":"M467*100/M1340","v":3.4951888933758513},{"$f":"IF(J467-J466=0,\"\",J467-J466)","v":-35},{"$f":"IF(K467-K466=0,\"\",K467-K466)","v":78},{"$f":"IF(L467-L466=0,\"\",L467-L466)","v":28},{"$f":"IF(M467-M466=0,\"\",M467-M466)","v":114},{"$f":"IF(N467-N466=0,\"\",N467-N466)","v":925},{"$f":"IF(M467=0,0,H467/M467)","v":0.64800796812749006},{"$f":"IF(M467=0,0,K467/M467)","v":0.21613545816733068},{"$f":"IF(M467=0,0,L467/M467)","v":0.13585657370517928},{"$f":"L467*100/B$1285","v":24098.939929328622}]
["2020-04-10T17:00:00",7,"Liguria",1076,151,1227,2074,3301,48,171,1181,709,5191,19514,{"$f":"IF(P468=\"x2\",M468,O467)","v":5191},{"$f":"IF(M468>O467*2,\"x2\",O467)","v":"x2"},{"$f":"IF(P468=\"x2\",M468,\"\")","v":5191},null,{"$f":"M468*100/M1341","v":3.5174857870806426},{"$f":"IF(J468-J467=0,\"\",J468-J467)","v":57},{"$f":"IF(K468-K467=0,\"\",K468-K467)","v":96},{"$f":"IF(L468-L467=0,\"\",L468-L467)","v":27},{"$f":"IF(M468-M467=0,\"\",M468-M467)","v":171},{"$f":"IF(N468-N467=0,\"\",N468-N467)","v":1068},{"$f":"IF(M468=0,0,H468/M468)","v":0.63590830283182431},{"$f":"IF(M468=0,0,K468/M468)","v":0.22750915045270662},{"$f":"IF(M468=0,0,L468/M468)","v":0.13658254671546907},{"$f":"L468*100/B$1285","v":25053.003533568903}]
["2020-04-11T17:00:00",7,"Liguria",1003,146,1149,2184,3333,32,185,1309,734,5376,20888,{"$f":"IF(P469=\"x2\",M469,O468)","v":5191},{"$f":"IF(M469>O468*2,\"x2\",O468)","v":5191},{"$f":"IF(P469=\"x2\",M469,\"\")","v":""},null,{"$f":"M469*100/M1342","v":3.530547510688181},{"$f":"IF(J469-J468=0,\"\",J469-J468)","v":14},{"$f":"IF(K469-K468=0,\"\",K469-K468)","v":128},{"$f":"IF(L469-L468=0,\"\",L469-L468)","v":25},{"$f":"IF(M469-M468=0,\"\",M469-M468)","v":185},{"$f":"IF(N469-N468=0,\"\",N469-N468)","v":1374},{"$f":"IF(M469=0,0,H469/M469)","v":0.6199776785714286},{"$f":"IF(M469=0,0,K469/M469)","v":0.24348958333333334},{"$f":"IF(M469=0,0,L469/M469)","v":0.13653273809523808},{"$f":"L469*100/B$1285","v":25936.395759717314}]
["2020-04-12T17:00:00",7,"Liguria",1032,144,1176,2157,3333,0,118,1412,749,5494,21983,{"$f":"IF(P470=\"x2\",M470,O469)","v":5191},{"$f":"IF(M470>O469*2,\"x2\",O469)","v":5191},{"$f":"IF(P470=\"x2\",M470,\"\")","v":""},null,{"$f":"M470*100/M1343","v":3.5136189507747995},{"$f":"IF(J470-J469=0,\"\",J470-J469)","v":-67},{"$f":"IF(K470-K469=0,\"\",K470-K469)","v":103},{"$f":"IF(L470-L469=0,\"\",L470-L469)","v":15},{"$f":"IF(M470-M469=0,\"\",M470-M469)","v":118},{"$f":"IF(N470-N469=0,\"\",N470-N469)","v":1095},{"$f":"IF(M470=0,0,H470/M470)","v":0.60666181288678556},{"$f":"IF(M470=0,0,K470/M470)","v":0.25700764470331272},{"$f":"IF(M470=0,0,L470/M470)","v":0.13633054240990172},{"$f":"L470*100/B$1285","v":26466.431095406359}]
["2020-04-13T17:00:00",7,"Liguria",1088,138,1226,2139,3365,32,102,1471,760,5596,23129,{"$f":"IF(P471=\"x2\",M471,O470)","v":5191},{"$f":"IF(M471>O470*2,\"x2\",O470)","v":5191},{"$f":"IF(P471=\"x2\",M471,\"\")","v":""},null,{"$f":"M471*100/M1344","v":3.508112038917726},{"$f":"IF(J471-J470=0,\"\",J471-J470)","v":-16},{"$f":"IF(K471-K470=0,\"\",K471-K470)","v":59},{"$f":"IF(L471-L470=0,\"\",L471-L470)","v":11},{"$f":"IF(M471-M470=0,\"\",M471-M470)","v":102},{"$f":"IF(N471-N470=0,\"\",N471-N470)","v":1146},{"$f":"IF(M471=0,0,H471/M471)","v":0.60132237312365977},{"$f":"IF(M471=0,0,K471/M471)","v":0.26286633309506791},{"$f":"IF(M471=0,0,L471/M471)","v":0.13581129378127232},{"$f":"L471*100/B$1285","v":26855.123674911662}]
["2020-04-14T17:00:00",7,"Liguria",967,133,1100,2366,3466,101,212,1549,793,5808,24446,{"$f":"IF(P472=\"x2\",M472,O471)","v":5191},{"$f":"IF(M472>O471*2,\"x2\",O471)","v":5191},{"$f":"IF(P472=\"x2\",M472,\"\")","v":""},null,{"$f":"M472*100/M1345","v":3.5744178031608489},{"$f":"IF(J472-J471=0,\"\",J472-J471)","v":110},{"$f":"IF(K472-K471=0,\"\",K472-K471)","v":78},{"$f":"IF(L472-L471=0,\"\",L472-L471)","v":33},{"$f":"IF(M472-M471=0,\"\",M472-M471)","v":212},{"$f":"IF(N472-N471=0,\"\",N472-N471)","v":1317},{"$f":"IF(M472=0,0,H472/M472)","v":0.596763085399449},{"$f":"IF(M472=0,0,K472/M472)","v":0.26670110192837465},{"$f":"IF(M472=0,0,L472/M472)","v":0.13653581267217632},{"$f":"L472*100/B$1285","v":28021.20141342756}]
["2020-04-15T17:00:00",7,"Liguria",959,120,1079,2385,3464,-2,128,1665,807,5936,25793,{"$f":"IF(P473=\"x2\",M473,O472)","v":5191},{"$f":"IF(M473>O472*2,\"x2\",O472)","v":5191},{"$f":"IF(P473=\"x2\",M473,\"\")","v":""},null,{"$f":"M473*100/M1346","v":3.594199388453271},{"$f":"IF(J473-J472=0,\"\",J473-J472)","v":-84},{"$f":"IF(K473-K472=0,\"\",K473-K472)","v":116},{"$f":"IF(L473-L472=0,\"\",L473-L472)","v":14},{"$f":"IF(M473-M472=0,\"\",M473-M472)","v":128},{"$f":"IF(N473-N472=0,\"\",N473-N472)","v":1347},{"$f":"IF(M473=0,0,H473/M473)","v":0.5835579514824798},{"$f":"IF(M473=0,0,K473/M473)","v":0.28049191374663074},{"$f":"IF(M473=0,0,L473/M473)","v":0.13595013477088949},{"$f":"L473*100/B$1285","v":28515.901060070672}]
[{"$f":"A473 + 1","v":"2020-04-16T17:00:00"},null,null,null,null,null,null,null,null,null,null,null,null,null,null,"Media x2",{"$f":"COUNT(M422:M473) / COUNT(Q422:Q473)","v":5.2}]
[{"$f":"A474+1","v":"2020-04-17T17:00:00"}]
[{"$f":"A475+1","v":"2020-04-18T17:00:00"}]
[null,null,null,null,{"$f":"E473/$M473","v":2.0215633423180591E-2},null,null,{"$f":"H473/$M473","v":0.5835579514824798},null,null,{"$f":"K473/$M473","v":0.28049191374663074},{"$f":"L473/$M473","v":0.13595013477088949},null,{"$f":"N473/$M473","v":4.345181940700809}]
[]
[]
[]
["Data","Codice","Regione","Ricoverati","Terap. Intens.","Ospedalizzati","Quarantena","Positivi","+ Positivi","Nuovi","Guariti","Deceduti","Totale","Tamponi",null,null,"x 2",null,"% su Tot.","+ Nuovi","+ Guariti","+ Deceduti","+ Totali","+ Tamponi","% Positivi","% Guariti","% Deceduti","P. Stimati"]
["2020-02-24T18:00:00",8,"Emilia Romagna",10,2,12,6,18,0,18,0,0,18,148,{"$f":"M482","v":18},null,{"$f":"M482","v":18},null,{"$f":"M482*100/M1295","v":7.8602620087336241},null,null,null,null,null,{"$f":"IF(M482=0,0,H482/M482)","v":1},{"$f":"IF(M482=0,0,K482/M482)","v":0},{"$f":"IF(M482=0,0,L482/M482)","v":0},{"$f":"L482*100/B$1285","v":0}]
["2020-02-25T18:00:00",8,"Emilia Romagna",15,2,17,9,26,8,8,0,0,26,391,{"$f":"IF(P483=\"x2\",M483,O482)","v":18},{"$f":"IF(M483>O482*2,\"x2\",O482)","v":18},{"$f":"IF(P483=\"x2\",M483,\"\")","v":""},null,{"$f":"M483*100/M1296","v":8.0745341614906838},{"$f":"IF(J483-J482=0,\"\",J483-J482)","v":-10},{"$f":"IF(K483-K482=0,\"\",K483-K482)","v":""},{"$f":"IF(L483-L482=0,\"\",L483-L482)","v":""},{"$f":"IF(M483-M482=0,\"\",M483-M482)","v":8},{"$f":"IF(N483-N482=0,\"\",N483-N482)","v":243},1,0,0,{"$f":"L483*100/B$1285","v":0}]
["2020-02-26T18:00:00",8,"Emilia Romagna",20,3,23,23,46,20,20,0,1,47,577,47,"x2",47,null,{"$f":"M484*100/M1297","v":11.75},12,"",1,21,186,0.97872340425531912,0,2.1276595744680851E-2,{"$f":"L484*100/B$1285","v":35.335689045936398}]
["2020-02-27T18:00:00",8,"Emilia Romagna",36,6,42,54,96,50,50,0,1,97,1033,97,"x2",97,null,{"$f":"M485*100/M1298","v":14.923076923076923},30,"","",50,456,0.98969072164948457,0,1.0309278350515464E-2,{"$f":"L485*100/B$1285","v":35.335689045936398}]
["2020-02-28T18:00:00",8,"Emilia Romagna",56,6,62,81,143,47,47,0,2,145,1277,97,97,"",null,{"$f":"M486*100/M1299","v":16.328828828828829},-3,"",1,48,244,0.98620689655172411,0,1.3793103448275862E-2,{"$f":"L486*100/B$1285","v":70.671378091872796}]
["2020-02-29T17:00:00",8,"Emilia Romagna",86,11,97,116,213,70,70,0,4,217,1550,217,"x2",217,null,{"$f":"M487*100/M1300","v":19.23758865248227},23,"",2,72,273,0.98156682027649766,0,1.8433179723502304E-2,{"$f":"L487*100/B$1285","v":141.34275618374559}]
["2020-03-01T17:00:00",8,"Emilia Romagna",127,13,140,137,277,64,64,0,8,285,1795,217,217,"",null,{"$f":"M488*100/M1301","v":16.824085005903189},-6,"",4,68,245,0.97192982456140353,0,2.8070175438596492E-2,{"$f":"L488*100/B$1285","v":282.68551236749119}]
["2020-03-02T18:00:00",8,"Emilia Romagna",148,16,164,160,324,47,47,0,11,335,1973,217,217,"",null,{"$f":"M489*100/M1302","v":16.453831041257367},-17,"",3,50,178,0.96716417910447761,0,3.2835820895522387E-2,{"$f":"L489*100/B$1285","v":388.69257950530033}]
["2020-03-03T18:00:00",8,"Emilia Romagna",187,24,211,187,398,74,74,4,18,420,2012,217,217,"",null,{"$f":"M490*100/M1303","v":16.786570743405274},27,4,7,85,39,0.94761904761904758,9.5238095238095247E-3,4.2857142857142858E-2,{"$f":"L490*100/B$1285","v":636.0424028268551}]
["2020-03-04T17:00:00",8,"Emilia Romagna",256,26,282,234,516,118,118,6,22,544,2500,544,"x2",544,null,{"$f":"M491*100/M1304","v":17.610877306571705},44,2,4,124,488,0.94852941176470584,1.1029411764705883E-2,4.0441176470588237E-2,{"$f":"L491*100/B$1285","v":777.38515901060066}]
["2020-03-05T17:00:00",8,"Emilia Romagna",327,32,359,299,658,142,142,10,30,698,2884,544,544,"",null,{"$f":"M492*100/M1305","v":18.092275790565061},24,4,8,154,384,0.94269340974212035,1.4326647564469915E-2,4.2979942693409739E-2,{"$f":"L492*100/B$1285","v":1060.0706713780919}]
["2020-03-06T17:00:00",8,"Emilia Romagna",397,53,450,366,816,158,158,17,37,870,3136,544,544,"",null,{"$f":"M493*100/M1306","v":18.766177739430542},16,7,7,172,252,0.93793103448275861,1.9540229885057471E-2,4.2528735632183907E-2,{"$f":"L493*100/B$1285","v":1307.4204946996465}]
["2020-03-07T18:00:00",8,"Emilia Romagna",464,64,528,409,937,121,121,25,48,1010,3604,544,544,"",null,{"$f":"M494*100/M1307","v":17.16811150773415},-37,8,11,140,468,0.92772277227722777,2.4752475247524754E-2,4.7524752475247525E-2,{"$f":"L494*100/B$1285","v":1696.113074204947}]
["2020-03-08T18:00:00",8,"Emilia Romagna",542,75,617,480,1097,160,160,27,56,1180,4344,1180,"x2",1180,null,{"$f":"M495*100/M1308","v":16},39,2,8,170,740,0.9296610169491526,2.288135593220339E-2,4.7457627118644069E-2,{"$f":"L495*100/B$1285","v":1978.7985865724381}]
["2020-03-09T18:00:00",8,"Emilia Romagna",576,90,666,620,1286,189,189,30,70,1386,4906,1180,1180,"",null,{"$f":"M496*100/M1309","v":15.111208024422154},29,3,14,206,562,0.92784992784992781,2.1645021645021644E-2,5.0505050505050504E-2,{"$f":"L496*100/B$1285","v":2473.4982332155478}]
["2020-03-10T18:00:00",8,"Emilia Romagna",669,98,767,650,1417,131,131,31,85,1533,5494,1180,1180,"",null,{"$f":"M497*100/M1310","v":15.104936446940584},-58,1,15,147,588,0.92433137638617091,2.0221787345075015E-2,5.5446836268754074E-2,{"$f":"L497*100/B$1285","v":3003.5335689045937}]
["2020-03-11T17:00:00",8,"Emilia Romagna",745,104,849,739,1588,171,171,38,113,1739,6640,1180,1180,"",null,{"$f":"M498*100/M1311","v":13.954421441181191},40,7,28,206,1146,0.91316848763657277,2.1851638872915469E-2,6.4979873490511791E-2,{"$f":"L498*100/B$1285","v":3992.9328621908126}]
["2020-03-12T17:00:00",8,"Emilia Romagna",814,112,926,832,1758,170,170,43,146,1947,7600,1180,1180,"",null,{"$f":"M499*100/M1312","v":12.88294845497254},-1,5,33,208,960,0.90292758089368264,2.2085259373394967E-2,7.4987159732922443E-2,{"$f":"L499*100/B$1285","v":5159.0106007067134}]
["2020-03-13T17:00:00",8,"Emilia Romagna",942,128,1070,941,2011,253,253,51,201,2263,8787,1180,1180,"",null,{"$f":"M500*100/M1313","v":12.814269535673839},83,8,55,316,1187,0.88864339372514356,2.2536456031816175E-2,8.8820150243040213E-2,{"$f":"L500*100/B$1285","v":7102.4734982332157}]
["2020-03-14T17:00:00",8,"Emilia Romagna",1076,152,1228,1121,2349,338,338,54,241,2644,10043,2644,"x2",2644,null,{"$f":"M501*100/M1314","v":12.497045894975658},85,3,40,381,1256,0.88842662632375191,2.042360060514372E-2,9.114977307110439E-2,{"$f":"L501*100/B$1285","v":8515.9010600706715}]
["2020-03-15T17:00:00",8,"Emilia Romagna",1215,169,1384,1357,2741,392,392,68,284,3093,12054,2644,2644,"",null,{"$f":"M502*100/M1315","v":12.498484664807856},54,14,43,449,2011,0.88619463304235369,2.1985127707727127E-2,9.1820239249919167E-2,{"$f":"L502*100/B$1285","v":10035.335689045936}]
["2020-03-16T17:00:00",8,"Emilia Romagna",1362,197,1559,1529,3088,347,347,88,346,3522,13096,2644,2644,"",null,{"$f":"M503*100/M1316","v":12.587562544674768},-45,20,62,429,1042,0.87677455990914255,2.4985803520726858E-2,9.8239636570130601E-2,{"$f":"L503*100/B$1285","v":12226.148409893993}]
["2020-03-17T17:00:00",8,"Emilia Romagna",1566,223,1789,1615,3404,316,316,134,393,3931,14510,2644,2644,"",null,{"$f":"M504*100/M1317","v":12.476988510125055},-31,46,47,409,1414,0.8659374205036886,3.4088018315950139E-2,9.9974561180361229E-2,{"$f":"L504*100/B$1285","v":13886.925795053003}]
["2020-03-18T17:00:00",8,"Emilia Romagna",1784,247,2031,1884,3915,511,511,152,458,4525,15461,2644,2644,"",null,{"$f":"M505*100/M1318","v":12.670456136420912},195,18,65,594,951,0.86519337016574582,3.3591160220994475E-2,0.10121546961325967,{"$f":"L505*100/B$1285","v":16183.745583038868}]
["2020-03-19T17:00:00",8,"Emilia Romagna",1900,260,2160,2346,4506,591,591,177,531,5214,18344,2644,2644,"",null,{"$f":"M506*100/M1319","v":12.706226392104302},80,25,73,689,2883,0.86421173762945913,3.394706559263521E-2,0.10184119677790564,{"$f":"L506*100/B$1285","v":18763.250883392226}]
["2020-03-20T17:00:00",8,"Emilia Romagna",2083,267,2350,2739,5089,583,583,239,640,5968,20753,5968,"x2",5968,null,{"$f":"M507*100/M1320","v":12.692201356840561},-8,62,109,754,{"$f":"IF(N507-N506=0,\"\",N507-N506)","v":2409},0.85271447721179627,4.0046916890080428E-2,0.10723860589812333,{"$f":"L507*100/B$1285","v":22614.840989399294}]
["2020-03-21T17:00:00",8,"Emilia Romagna",2267,265,2532,3129,5661,572,572,329,715,6705,24620,5968,5968,"",null,{"$f":"M508*100/M1321","v":12.514464892306544},-11,90,75,{"$f":"IF(M508-M507=0,\"\",M508-M507)","v":737},3867,0.84429530201342284,4.906785980611484E-2,0.10663683818046234,{"$f":"L508*100/B$1285","v":25265.017667844524}]
["2020-03-22T17:00:00",8,"Emilia Romagna",2429,269,2698,3692,6390,729,729,349,816,7555,28022,5968,5968,"",null,{"$f":"M509*100/M1322","v":12.775203760695323},157,20,101,850,3402,0.84579748510919917,4.6194573130377233E-2,0.10800794176042355,{"$f":"L509*100/B$1285","v":28833.922261484098}]
["2020-03-23T17:00:00",8,"Emilia Romagna",2846,276,3122,4098,7220,830,830,423,892,8535,31200,5968,5968,"",null,{"$f":"M510*100/M1323","v":13.351166173917123},101,74,76,980,3178,0.84592852958406561,4.9560632688927943E-2,0.10451083772700645,{"$f":"L510*100/B$1285","v":31519.434628975265}]
["2020-03-24T17:00:00",8,"Emilia Romagna",2974,291,3265,4446,7711,491,491,558,985,9254,33527,5968,5968,"",null,{"$f":"M511*100/M1324","v":13.377471955591535},-339,135,93,719,2327,0.83326129241409119,6.0298249405662419E-2,0.10644045818024638,{"$f":"L511*100/B$1285","v":34805.653710247352}]
["2020-03-25T17:00:00",8,"Emilia Romagna",3180,294,3474,4782,8256,545,545,721,1077,10054,38045,5968,5968,"",null,{"$f":"M512*100/M1325","v":13.515984190573494},54,163,92,800,4518,0.82116570519196341,7.1712751143823347E-2,0.10712154366421325,{"$f":"L512*100/B$1285","v":38056.5371024735}]
["2020-03-26T17:00:00",8,"Emilia Romagna",3354,301,3655,5195,8850,594,594,792,1174,10816,42395,5968,5968,"",null,{"$f":"M513*100/M1326","v":13.429518618309142},49,71,97,762,{"$f":"IF(N513-N512=0,\"\",N513-N512)","v":4350},0.81823224852071008,7.3224852071005916E-2,0.10854289940828403,{"$f":"L513*100/B$1285","v":41484.098939929325}]
["2020-03-27T17:00:00",8,"Emilia-Romagna",3461,308,3769,5592,9361,511,772,960,1267,11588,47798,{"$f":"IF(P514=\"x2\",M514,O513)","v":5968},{"$f":"IF(M514>O513*2,\"x2\",O513)","v":5968},{"$f":"IF(P514=\"x2\",M514,\"\")","v":""},null,{"$f":"M514*100/M1327","v":13.396841545469259},{"$f":"IF(J514-J513=0,\"\",J514-J513)","v":178},168,93,772,5403,0.80781843286158095,8.2844321712115976E-2,0.10933724542630308,{"$f":"L514*100/B$1285","v":44770.318021201412}]
["2020-03-28T17:00:00",8,"Emilia-Romagna",3695,316,4011,5953,9964,603,795,1075,1344,12383,52991,12383,"x2",12383,null,{"$f":"M515*100/M1328","v":13.391080543299593},23,115,77,795,5193,0.80465153839941861,8.6812565614148435E-2,0.10853589598643301,{"$f":"L515*100/B$1285","v":47491.166077738511}]
["2020-03-29T17:00:00",8,"Emilia-Romagna",3769,333,4102,6433,10535,571,736,1141,1443,13119,52991,12383,12383,"",null,{"$f":"M516*100/M1329","v":13.429352332401805},-59,66,99,736,"",0.803033767817669,8.6973092461315654E-2,0.10999313972101532,{"$f":"L516*100/B$1285","v":50989.399293286217}]
["2020-03-30T17:00:00",8,"Emilia-Romagna",3779,351,4130,6636,10766,231,412,1227,1538,13531,50990,12383,12383,"",null,{"$f":"M517*100/M1330","v":13.299717905621247},-324,86,95,412,-2001,0.79565442317640978,9.0680659226960308E-2,0.11366491759662996,{"$f":"L517*100/B$1285","v":54346.289752650177}]
["2020-03-31T17:00:00",8,"Emilia-Romagna",3765,353,4118,6835,10953,187,543,1477,1644,14074,54532,12383,12383,"",null,{"$f":"M518*100/M1331","v":13.303463399879007},131,250,106,543,3542,0.77824356970299846,0.10494528918573255,0.116811141111269,{"$f":"L518*100/B$1285","v":58091.872791519432}]
["2020-04-01T17:00:00",8,"Emilia-Romagna",3898,359,4257,7232,11489,536,713,1566,1732,14787,58457,12383,12383,"",null,{"$f":"M519*100/M1332","v":13.372944815236854},170,89,88,713,{"$f":"IF(N519-N518=0,\"\",N519-N518)","v":3925},{"$f":"IF(M519=0,0,H519/M519)","v":0.77696625414215192},{"$f":"IF(M519=0,0,K519/M519)","v":0.10590383444917834},{"$f":"IF(M519=0,0,L519/M519)","v":0.11712991140866978},{"$f":"L519*100/B$1285","v":61201.413427561834}]
["2020-04-02T17:00:00",8,"Emilia-Romagna",3944,366,4310,7549,11859,370,546,1663,1811,15333,60507,{"$f":"IF(P520=\"x2\",M520,O519)","v":12383},{"$f":"IF(M520>O519*2,\"x2\",O519)","v":12383},{"$f":"IF(P520=\"x2\",M520,\"\")","v":""},null,{"$f":"M520*100/M1333","v":13.305045035664081},{"$f":"IF(J520-J519=0,\"\",J520-J519)","v":-167},{"$f":"IF(K520-K519=0,\"\",K520-K519)","v":97},{"$f":"IF(L520-L519=0,\"\",L520-L519)","v":79},{"$f":"IF(M520-M519=0,\"\",M520-M519)","v":546},2050,0.77342985717080803,0.10845887954085959,0.11811126328833235,{"$f":"L520*100/B$1285","v":63992.932862190813}]
["2020-04-03T17:00:00",8,"Emilia-Romagna",3915,364,4279,7899,12178,319,599,1852,1902,15932,63682,{"$f":"IF(P521=\"x2\",M521,O520)","v":12383},{"$f":"IF(M521>O520*2,\"x2\",O520)","v":12383},{"$f":"IF(P521=\"x2\",M521,\"\")","v":""},null,{"$f":"M521*100/M1334","v":13.295834828544486},{"$f":"IF(J521-J520=0,\"\",J521-J520)","v":53},{"$f":"IF(K521-K520=0,\"\",K521-K520)","v":189},{"$f":"IF(L521-L520=0,\"\",L521-L520)","v":91},{"$f":"IF(M521-M520=0,\"\",M521-M520)","v":599},3175,0.76437358774792874,0.11624403715792117,0.11938237509415014,{"$f":"L521*100/B$1285","v":67208.480565371021}]
["2020-04-04T17:00:00",8,"Emilia-Romagna",3859,358,4217,8306,12523,345,608,2040,1977,16540,67075,{"$f":"IF(P522=\"x2\",M522,O521)","v":12383},{"$f":"IF(M522>O521*2,\"x2\",O521)","v":12383},{"$f":"IF(P522=\"x2\",M522,\"\")","v":""},null,{"$f":"M522*100/M1335","v":13.271070030168817},{"$f":"IF(J522-J521=0,\"\",J522-J521)","v":9},{"$f":"IF(K522-K521=0,\"\",K522-K521)","v":188},{"$f":"IF(L522-L521=0,\"\",L522-L521)","v":75},{"$f":"IF(M522-M521=0,\"\",M522-M521)","v":608},3393,0.75713422007255138,0.12333736396614269,0.11952841596130592,{"$f":"L522*100/B$1285","v":69858.657243816255}]
["2020-04-05T17:00:00",8,"Emilia-Romagna",3839,375,4214,8623,12837,314,549,2201,2051,17089,69986,{"$f":"IF(P523=\"x2\",M523,O522)","v":12383},{"$f":"IF(M523>O522*2,\"x2\",O522)","v":12383},{"$f":"IF(P523=\"x2\",M523,\"\")","v":""},null,{"$f":"M523*100/M1336","v":13.252628966715266},{"$f":"IF(J523-J522=0,\"\",J523-J522)","v":-59},{"$f":"IF(K523-K522=0,\"\",K523-K522)","v":161},{"$f":"IF(L523-L522=0,\"\",L523-L522)","v":74},{"$f":"IF(M523-M522=0,\"\",M523-M522)","v":549},2911,0.75118497278951368,0.12879630171455322,0.12001872549593305,{"$f":"L523*100/B$1285","v":72473.498233215549}]
["2020-04-06T17:00:00",8,"Emilia-Romagna",3804,372,4176,8875,13051,214,467,2397,2108,17556,72163,{"$f":"IF(P524=\"x2\",M524,O523)","v":12383},{"$f":"IF(M524>O523*2,\"x2\",O523)","v":12383},{"$f":"IF(P524=\"x2\",M524,\"\")","v":""},null,{"$f":"M524*100/M1337","v":13.245113054237365},{"$f":"IF(J524-J523=0,\"\",J524-J523)","v":-82},{"$f":"IF(K524-K523=0,\"\",K524-K523)","v":196},{"$f":"IF(L524-L523=0,\"\",L524-L523)","v":57},{"$f":"IF(M524-M523=0,\"\",M524-M523)","v":467},2177,0.74339257233994072,0.13653451811346548,0.12007290954659376,{"$f":"L524*100/B$1285","v":74487.632508833922}]
["2020-04-07T17:00:00",8,"Emilia-Romagna",3750,366,4116,8932,13048,-3,269,2597,2180,17825,75191,{"$f":"IF(P525=\"x2\",M525,O524)","v":12383},{"$f":"IF(M525>O524*2,\"x2\",O524)","v":12383},{"$f":"IF(P525=\"x2\",M525,\"\")","v":""},null,{"$f":"M525*100/M1338","v":13.146637558449987},{"$f":"IF(J525-J524=0,\"\",J525-J524)","v":-198},{"$f":"IF(K525-K524=0,\"\",K525-K524)","v":200},{"$f":"IF(L525-L524=0,\"\",L525-L524)","v":72},{"$f":"IF(M525-M524=0,\"\",M525-M524)","v":269},{"$f":"IF(N525-N524=0,\"\",N525-N524)","v":3028},{"$f":"IF(M525=0,0,H525/M525)","v":0.73200561009817677},{"$f":"IF(M525=0,0,K525/M525)","v":0.14569424964936886},{"$f":"IF(M525=0,0,L525/M525)","v":0.12230014025245442},{"$f":"L525*100/B$1285","v":77031.802120141336}]
["2020-04-08T17:00:00",8,"Emilia-Romagna",3769,361,4130,8980,13110,62,409,2890,2234,18234,78367,{"$f":"IF(P526=\"x2\",M526,O525)","v":12383},{"$f":"IF(M526>O525*2,\"x2\",O525)","v":12383},{"$f":"IF(P526=\"x2\",M526,\"\")","v":""},null,{"$f":"M526*100/M1339","v":13.078280328785988},{"$f":"IF(J526-J525=0,\"\",J526-J525)","v":140},{"$f":"IF(K526-K525=0,\"\",K526-K525)","v":293},{"$f":"IF(L526-L525=0,\"\",L526-L525)","v":54},{"$f":"IF(M526-M525=0,\"\",M526-M525)","v":409},{"$f":"IF(N526-N525=0,\"\",N526-N525)","v":3176},{"$f":"IF(M526=0,0,H526/M526)","v":0.71898650871997372},{"$f":"IF(M526=0,0,K526/M526)","v":0.15849511900844576},{"$f":"IF(M526=0,0,L526/M526)","v":0.12251837227158056},{"$f":"L526*100/B$1285","v":78939.929328621904}]
["2020-04-09T17:00:00",8,"Emilia-Romagna",3722,355,4077,9181,13258,148,443,3103,2316,18677,81715,{"$f":"IF(P527=\"x2\",M527,O526)","v":12383},{"$f":"IF(M527>O526*2,\"x2\",O526)","v":12383},{"$f":"IF(P527=\"x2\",M527,\"\")","v":""},null,{"$f":"M527*100/M1340","v":13.003912940553938},{"$f":"IF(J527-J526=0,\"\",J527-J526)","v":34},{"$f":"IF(K527-K526=0,\"\",K527-K526)","v":213},{"$f":"IF(L527-L526=0,\"\",L527-L526)","v":82},{"$f":"IF(M527-M526=0,\"\",M527-M526)","v":443},{"$f":"IF(N527-N526=0,\"\",N527-N526)","v":3348},{"$f":"IF(M527=0,0,H527/M527)","v":0.7098570434223912},{"$f":"IF(M527=0,0,K527/M527)","v":0.16614017240456175},{"$f":"IF(M527=0,0,L527/M527)","v":0.12400278417304707},{"$f":"L527*100/B$1285","v":81837.455830388688}]
["2020-04-10T17:00:00",8,"Emilia-Romagna",3596,349,3945,9405,13350,92,451,3381,2397,19128,85884,{"$f":"IF(P528=\"x2\",M528,O527)","v":12383},{"$f":"IF(M528>O527*2,\"x2\",O527)","v":12383},{"$f":"IF(P528=\"x2\",M528,\"\")","v":""},null,{"$f":"M528*100/M1341","v":12.961369319067334},{"$f":"IF(J528-J527=0,\"\",J528-J527)","v":8},{"$f":"IF(K528-K527=0,\"\",K528-K527)","v":278},{"$f":"IF(L528-L527=0,\"\",L528-L527)","v":81},{"$f":"IF(M528-M527=0,\"\",M528-M527)","v":451},{"$f":"IF(N528-N527=0,\"\",N528-N527)","v":4169},{"$f":"IF(M528=0,0,H528/M528)","v":0.6979297365119197},{"$f":"IF(M528=0,0,K528/M528)","v":0.17675658720200751},{"$f":"IF(M528=0,0,L528/M528)","v":0.12531367628607276},{"$f":"L528*100/B$1285","v":84699.646643109532}]
["2020-04-11T17:00:00",8,"Emilia-Romagna",3530,341,3871,9624,13495,145,507,3659,2481,19635,91759,{"$f":"IF(P529=\"x2\",M529,O528)","v":12383},{"$f":"IF(M529>O528*2,\"x2\",O528)","v":12383},{"$f":"IF(P529=\"x2\",M529,\"\")","v":""},null,{"$f":"M529*100/M1342","v":12.894773134740037},{"$f":"IF(J529-J528=0,\"\",J529-J528)","v":56},{"$f":"IF(K529-K528=0,\"\",K529-K528)","v":278},{"$f":"IF(L529-L528=0,\"\",L529-L528)","v":84},{"$f":"IF(M529-M528=0,\"\",M529-M528)","v":507},{"$f":"IF(N529-N528=0,\"\",N529-N528)","v":5875},{"$f":"IF(M529=0,0,H529/M529)","v":0.68729309905780489},{"$f":"IF(M529=0,0,K529/M529)","v":0.18635090399796281},{"$f":"IF(M529=0,0,L529/M529)","v":0.12635599694423225},{"$f":"L529*100/B$1285","v":87667.844522968197}]
["2020-04-12T17:00:00",8,"Emilia-Romagna",3491,335,3826,9846,13672,177,463,3862,2564,20098,96704,{"$f":"IF(P530=\"x2\",M530,O529)","v":12383},{"$f":"IF(M530>O529*2,\"x2\",O529)","v":12383},{"$f":"IF(P530=\"x2\",M530,\"\")","v":""},null,{"$f":"M530*100/M1343","v":12.85342440347141},{"$f":"IF(J530-J529=0,\"\",J530-J529)","v":-44},{"$f":"IF(K530-K529=0,\"\",K530-K529)","v":203},{"$f":"IF(L530-L529=0,\"\",L530-L529)","v":83},{"$f":"IF(M530-M529=0,\"\",M530-M529)","v":463},{"$f":"IF(N530-N529=0,\"\",N530-N529)","v":4945},{"$f":"IF(M530=0,0,H530/M530)","v":0.6802666932033038},{"$f":"IF(M530=0,0,K530/M530)","v":0.19215842372375361},{"$f":"IF(M530=0,0,L530/M530)","v":0.12757488307294257},{"$f":"L530*100/B$1285","v":90600.706713780921}]
["2020-04-13T17:00:00",8,"Emilia-Romagna",3490,331,3821,9997,13818,146,342,4007,2615,20440,99047,{"$f":"IF(P531=\"x2\",M531,O530)","v":12383},{"$f":"IF(M531>O530*2,\"x2\",O530)","v":12383},{"$f":"IF(P531=\"x2\",M531,\"\")","v":""},null,{"$f":"M531*100/M1344","v":12.813761628927505},{"$f":"IF(J531-J530=0,\"\",J531-J530)","v":-121},{"$f":"IF(K531-K530=0,\"\",K531-K530)","v":145},{"$f":"IF(L531-L530=0,\"\",L531-L530)","v":51},{"$f":"IF(M531-M530=0,\"\",M531-M530)","v":342},{"$f":"IF(N531-N530=0,\"\",N531-N530)","v":2343},{"$f":"IF(M531=0,0,H531/M531)","v":0.67602739726027394},{"$f":"IF(M531=0,0,K531/M531)","v":0.19603718199608611},{"$f":"IF(M531=0,0,L531/M531)","v":0.12793542074363992},{"$f":"L531*100/B$1285","v":92402.826855123669}]
["2020-04-14T17:00:00",8,"Emilia-Romagna",3473,328,3801,9977,13778,-40,312,4269,2705,20752,101896,{"$f":"IF(P532=\"x2\",M532,O531)","v":12383},{"$f":"IF(M532>O531*2,\"x2\",O531)","v":12383},{"$f":"IF(P532=\"x2\",M532,\"\")","v":""},null,{"$f":"M532*100/M1345","v":12.771404657574713},{"$f":"IF(J532-J531=0,\"\",J532-J531)","v":-30},{"$f":"IF(K532-K531=0,\"\",K532-K531)","v":262},{"$f":"IF(L532-L531=0,\"\",L532-L531)","v":90},{"$f":"IF(M532-M531=0,\"\",M532-M531)","v":312},{"$f":"IF(N532-N531=0,\"\",N532-N531)","v":2849},{"$f":"IF(M532=0,0,H532/M532)","v":0.66393600616808024},{"$f":"IF(M532=0,0,K532/M532)","v":0.20571511179645335},{"$f":"IF(M532=0,0,L532/M532)","v":0.13034888203546646},{"$f":"L532*100/B$1285","v":95583.038869257944}]
["2020-04-15T17:00:00",8,"Emilia-Romagna",3388,325,3713,9864,13577,-201,277,4664,2788,21029,106149,{"$f":"IF(P533=\"x2\",M533,O532)","v":12383},{"$f":"IF(M533>O532*2,\"x2\",O532)","v":12383},{"$f":"IF(P533=\"x2\",M533,\"\")","v":""},null,{"$f":"M533*100/M1346","v":12.732887287699434},{"$f":"IF(J533-J532=0,\"\",J533-J532)","v":-35},{"$f":"IF(K533-K532=0,\"\",K533-K532)","v":395},{"$f":"IF(L533-L532=0,\"\",L533-L532)","v":83},{"$f":"IF(M533-M532=0,\"\",M533-M532)","v":277},{"$f":"IF(N533-N532=0,\"\",N533-N532)","v":4253},{"$f":"IF(M533=0,0,H533/M533)","v":0.64563222216938509},{"$f":"IF(M533=0,0,K533/M533)","v":0.22178895810547339},{"$f":"IF(M533=0,0,L533/M533)","v":0.13257881972514146},{"$f":"L533*100/B$1285","v":98515.901060070668}]
[{"$f":"A533 + 1","v":"2020-04-16T17:00:00"},null,null,null,null,null,null,null,null,null,null,null,null,null,null,"Media x2",{"$f":"COUNT(M482:M533) / COUNT(Q482:Q533)","v":5.7777777777777777}]
[{"$f":"A534+1","v":"2020-04-17T17:00:00"}]
[{"$f":"A535+1","v":"2020-04-18T17:00:00"}]
[null,null,null,null,{"$f":"E533/$M533","v":1.5454848066955157E-2},null,null,{"$f":"H533/$M533","v":0.64563222216938509},null,null,{"$f":"K533/$M533","v":0.22178895810547339},{"$f":"L533/$M533","v":0.13257881972514146},null,{"$f":"N533/$M533","v":5.0477435921822247}]
[]
[]
[]
["Data","Codice","Regione","Ricoverati","Terap. Intens.","Ospedalizzati","Quarantena","Positivi","+ Positivi","Nuovi","Guariti","Deceduti","Totale","Tamponi",null,null,"x 2",null,"% su Tot.","+ Nuovi","+ Guariti","+ Deceduti","+ Totali","+ Tamponi","% Positivi","% Guariti","% Deceduti","P. Stimati"]
["2020-02-24T18:00:00",9,"Toscana",0,0,0,0,0,0,0,0,0,0,140,{"$f":"M542","v":0},null,{"$f":"M542","v":0},null,{"$f":"M542*100/M1295","v":0},null,null,null,null,null,{"$f":"IF(M542=0,0,H542/M542)","v":0},{"$f":"IF(M542=0,0,K542/M542)","v":0},{"$f":"IF(M542=0,0,L542/M542)","v":0},{"$f":"L542*100/B$1285","v":0}]
["2020-02-25T18:00:00",9,"Toscana",2,0,2,0,2,2,2,0,0,2,296,{"$f":"IF(P543=\"x2\",M543,O542)","v":2},{"$f":"IF(M543>O542*2,\"x2\",O542)","v":"x2"},{"$f":"IF(P543=\"x2\",M543,\"\")","v":2},null,{"$f":"M543*100/M1296","v":0.6211180124223602},{"$f":"IF(J543-J542=0,\"\",J543-J542)","v":2},{"$f":"IF(K543-K542=0,\"\",K543-K542)","v":""},{"$f":"IF(L543-L542=0,\"\",L543-L542)","v":""},{"$f":"IF(M543-M542=0,\"\",M543-M542)","v":2},{"$f":"IF(N543-N542=0,\"\",N543-N542)","v":156},1,0,0,{"$f":"L543*100/B$1285","v":0}]
["2020-02-26T18:00:00",9,"Toscana",2,0,2,0,2,0,0,0,0,2,363,2,2,"",null,{"$f":"M544*100/M1297","v":0.5},-2,"","","",67,1,0,0,{"$f":"L544*100/B$1285","v":0}]
["2020-02-27T18:00:00",9,"Toscana",2,0,2,0,2,0,0,0,0,2,410,2,2,"",null,{"$f":"M545*100/M1298","v":0.30769230769230771},"","","","",47,1,0,0,{"$f":"L545*100/B$1285","v":0}]
["2020-02-28T18:00:00",9,"Toscana",5,0,5,2,7,5,5,1,0,8,437,8,"x2",8,null,{"$f":"M546*100/M1299","v":0.90090090090090091},5,1,"",6,27,0.875,0.125,0,{"$f":"L546*100/B$1285","v":0}]
["2020-02-29T17:00:00",9,"Toscana",7,0,7,3,10,3,3,1,0,11,531,8,8,"",null,{"$f":"M547*100/M1300","v":0.97517730496453903},-2,"","",3,94,0.90909090909090906,9.0909090909090912E-2,0,{"$f":"L547*100/B$1285","v":0}]
["2020-03-01T17:00:00",9,"Toscana",7,0,7,5,12,2,2,1,0,13,572,8,8,"",null,{"$f":"M548*100/M1301","v":0.76741440377804016},-1,"","",2,41,0.92307692307692313,7.6923076923076927E-2,0,{"$f":"L548*100/B$1285","v":0}]
["2020-03-02T18:00:00",9,"Toscana",7,0,7,5,12,0,0,1,0,13,613,8,8,"",null,{"$f":"M549*100/M1302","v":0.63850687622789781},-2,"","","",41,0.92307692307692313,7.6923076923076927E-2,0,{"$f":"L549*100/B$1285","v":0}]
["2020-03-03T18:00:00",9,"Toscana",10,0,10,8,18,6,6,1,0,19,697,19,"x2",19,null,{"$f":"M550*100/M1303","v":0.75939248601119103},6,"","",6,84,0.94736842105263153,5.2631578947368418E-2,0,{"$f":"L550*100/B$1285","v":0}]
["2020-03-04T17:00:00",9,"Toscana",15,2,17,20,37,19,19,1,0,38,776,19,19,"",null,{"$f":"M551*100/M1304","v":1.2301715765619943},13,"","",19,79,0.97368421052631582,2.6315789473684209E-2,0,{"$f":"L551*100/B$1285","v":0}]
["2020-03-05T17:00:00",9,"Toscana",26,3,29,31,60,23,23,1,0,61,776,61,"x2",61,null,{"$f":"M552*100/M1305","v":1.5811301192327631},4,"","",23,"",0.98360655737704916,1.6393442622950821E-2,0,{"$f":"L552*100/B$1285","v":0}]
["2020-03-06T17:00:00",9,"Toscana",35,5,40,38,78,18,18,1,0,79,1097,61,61,"",null,{"$f":"M553*100/M1306","v":1.7040552200172563},-5,"","",18,321,0.98734177215189878,1.2658227848101266E-2,0,{"$f":"L553*100/B$1285","v":0}]
["2020-03-07T18:00:00",9,"Toscana",54,7,61,51,112,34,34,1,0,113,1331,61,61,"",null,{"$f":"M554*100/M1307","v":1.9207887132415433},16,"","",34,234,0.99115044247787609,8.8495575221238937E-3,0,{"$f":"L554*100/B$1285","v":0}]
["2020-03-08T18:00:00",9,"Toscana",91,7,98,67,165,53,53,1,0,166,1618,166,"x2",166,null,{"$f":"M555*100/M1308","v":2.2508474576271187},19,"","",53,287,0.99397590361445787,6.024096385542169E-3,0,{"$f":"L555*100/B$1285","v":0}]
["2020-03-09T18:00:00",9,"Toscana",107,9,116,90,206,41,41,1,1,208,2018,166,166,"",null,{"$f":"M556*100/M1309","v":2.26777147841256},-12,"",1,42,400,0.99038461538461542,4.807692307692308E-3,4.807692307692308E-3,{"$f":"L556*100/B$1285","v":35.335689045936398}]
["2020-03-10T18:00:00",9,"Toscana",91,40,131,129,260,54,54,3,1,264,2573,166,166,"",null,{"$f":"M557*100/M1310","v":2.6012415016257759},13,2,"",56,555,0.98484848484848486,1.1363636363636364E-2,3.787878787878788E-3,{"$f":"L557*100/B$1285","v":35.335689045936398}]
["2020-03-11T17:00:00",9,"Toscana",87,54,141,173,314,54,54,5,1,320,2804,166,166,"",null,{"$f":"M558*100/M1311","v":2.5678061306371367},"",2,"",56,231,0.98124999999999996,1.5625E-2,3.1250000000000002E-3,{"$f":"L558*100/B$1285","v":35.335689045936398}]
["2020-03-12T17:00:00",9,"Toscana",100,59,159,193,352,38,38,7,5,364,3165,364,"x2",364,null,{"$f":"M559*100/M1312","v":2.4085224641037519},-16,2,4,44,361,0.96703296703296704,1.9230769230769232E-2,1.3736263736263736E-2,{"$f":"L559*100/B$1285","v":176.67844522968198}]
["2020-03-13T17:00:00",9,"Toscana",134,77,211,244,455,103,103,10,5,470,4049,364,364,"",null,{"$f":"M560*100/M1313","v":2.6613816534541335},65,3,"",106,884,0.96808510638297873,2.1276595744680851E-2,1.0638297872340425E-2,{"$f":"L560*100/B$1285","v":176.67844522968198}]
["2020-03-14T17:00:00",9,"Toscana",160,87,247,367,614,159,159,10,6,630,4595,364,364,"",null,{"$f":"M561*100/M1314","v":2.97773786453656},56,"",1,160,546,0.97460317460317458,1.5873015873015872E-2,9.5238095238095247E-3,{"$f":"L561*100/B$1285","v":212.01413427561837}]
["2020-03-15T17:00:00",9,"Toscana",175,107,282,481,763,149,149,10,8,781,5132,781,"x2",781,null,{"$f":"M562*100/M1315","v":3.1559380935062835},-10,"",2,151,537,0.97695262483994882,1.2804097311139564E-2,1.0243277848911651E-2,{"$f":"L562*100/B$1285","v":282.68551236749119}]
["2020-03-16T17:00:00",9,"Toscana",175,107,282,559,841,78,78,11,14,866,5910,781,781,"",null,{"$f":"M563*100/M1316","v":3.0950679056468906},-71,1,6,85,778,0.97113163972286376,1.2702078521939953E-2,1.6166281755196306E-2,{"$f":"L563*100/B$1285","v":494.69964664310953}]
["2020-03-17T17:00:00",9,"Toscana",329,143,472,552,1024,183,183,12,17,1053,6727,781,781,"",null,{"$f":"M564*100/M1317","v":3.342220529422967},105,1,3,187,817,0.97245963912630584,1.1396011396011397E-2,1.6144349477682812E-2,{"$f":"L564*100/B$1285","v":600.70671378091868}]
["2020-03-18T17:00:00",9,"Toscana",427,160,587,704,1291,267,267,17,22,1330,7606,781,781,"",null,{"$f":"M565*100/M1318","v":3.7241340688264777},84,5,5,277,879,0.97067669172932336,1.2781954887218045E-2,1.6541353383458645E-2,{"$f":"L565*100/B$1285","v":777.38515901060066}]
["2020-03-19T17:00:00",9,"Toscana",501,178,679,743,1422,131,131,22,38,1482,8873,781,781,"",null,{"$f":"M566*100/M1319","v":3.6115511149019128},-136,5,16,152,1267,0.95951417004048578,1.4844804318488529E-2,2.564102564102564E-2,{"$f":"L566*100/B$1285","v":1342.756183745583}]
["2020-03-20T17:00:00",9,"Toscana",601,189,790,923,1713,291,291,33,47,1793,10405,1793,"x2",1793,null,{"$f":"M567*100/M1320","v":3.8131898513430169},160,11,9,311,{"$f":"IF(N567-N566=0,\"\",N567-N566)","v":1532},0.95538204127161186,1.8404907975460124E-2,2.6213050752928055E-2,{"$f":"L567*100/B$1285","v":1660.7773851590105}]
["2020-03-21T17:00:00",9,"Toscana",664,202,866,1039,1905,192,192,35,72,2012,11909,1793,1793,"",null,{"$f":"M568*100/M1321","v":3.75527268655045},-99,2,25,{"$f":"IF(M568-M567=0,\"\",M568-M567)","v":219},1504,0.94681908548707749,1.7395626242544732E-2,3.5785288270377733E-2,{"$f":"L568*100/B$1285","v":2544.1696113074204}]
["2020-03-22T17:00:00",9,"Toscana",706,215,921,1223,2144,239,239,42,91,2277,13264,1793,1793,"",null,{"$f":"M569*100/M1322","v":3.8503162095437791},47,7,19,265,1355,0.9415898111550286,1.844532279314888E-2,3.9964866051822576E-2,{"$f":"L569*100/B$1285","v":3215.547703180212}]
["2020-03-23T17:00:00",9,"Toscana",838,238,1076,1225,2301,157,157,51,109,2461,13851,1793,1793,"",null,{"$f":"M570*100/M1323","v":3.849703568132401},-82,9,18,184,587,0.93498577813896788,2.0723283218203981E-2,4.4290938642828119E-2,{"$f":"L570*100/B$1285","v":3851.5901060070669}]
["2020-03-24T17:00:00",9,"Toscana",918,244,1162,1357,2519,218,218,51,129,2699,15701,1793,1793,"",null,{"$f":"M571*100/M1324","v":3.9016421880420955},61,"",20,238,1850,0.93330863282697296,1.8895887365690995E-2,4.7795479807336047E-2,{"$f":"L571*100/B$1285","v":4558.3038869257953}]
["2020-03-25T17:00:00",9,"Toscana",999,251,1250,1526,2776,257,257,54,142,2972,17868,1793,1793,"",null,{"$f":"M572*100/M1325","v":3.9953754738794935},39,3,13,273,2167,0.93405114401076716,1.8169582772543741E-2,4.7779273216689101E-2,{"$f":"L572*100/B$1285","v":5017.6678445229682}]
["2020-03-26T17:00:00",9,"Toscana",1037,259,1296,1677,2973,197,197,95,158,3226,20952,1793,1793,"",null,{"$f":"M573*100/M1326","v":4.0055128571251197},-60,41,16,254,{"$f":"IF(N573-N572=0,\"\",N573-N572)","v":3084},0.92157470551766896,2.944823310601364E-2,4.8977061376317424E-2,{"$f":"L573*100/B$1285","v":5583.03886925795}]
["2020-03-27T17:00:00",9,"Toscana",1053,274,1327,1843,3170,197,224,103,177,3450,23746,{"$f":"IF(P574=\"x2\",M574,O573)","v":1793},{"$f":"IF(M574>O573*2,\"x2\",O573)","v":1793},{"$f":"IF(P574=\"x2\",M574,\"\")","v":""},null,{"$f":"M574*100/M1327","v":3.9885315267405028},{"$f":"IF(J574-J573=0,\"\",J574-J573)","v":27},8,19,224,2794,0.91884057971014488,2.9855072463768118E-2,5.1304347826086956E-2,{"$f":"L574*100/B$1285","v":6254.4169611307416}]
["2020-03-28T17:00:00",9,"Toscana",1093,277,1370,2141,3511,341,367,108,198,3817,25613,3817,"x2",3817,null,{"$f":"M575*100/M1328","v":4.1277359633186261},143,5,21,367,1867,0.91983232905423107,2.829447209850668E-2,5.1873198847262249E-2,{"$f":"L575*100/B$1285","v":6996.4664310954058}]
["2020-03-29T17:00:00",9,"Toscana",1111,275,1386,2400,3786,275,305,121,215,4122,27579,3817,3817,"",null,{"$f":"M576*100/M1329","v":4.2195129441390531},-62,13,17,305,1966,0.91848617176128089,2.9354682193110139E-2,5.215914604560893E-2,{"$f":"L576*100/B$1285","v":7597.1731448763248}]
["2020-03-30T17:00:00",9,"Toscana",1116,279,1395,2655,4050,264,290,131,231,4412,30099,3817,3817,"",null,{"$f":"M577*100/M1330","v":4.3365867563078071},-15,10,16,290,2520,0.91795104261106075,2.9691749773345422E-2,5.2357207615593836E-2,{"$f":"L577*100/B$1285","v":8162.5441696113076}]
["2020-03-31T17:00:00",9,"Toscana",1120,293,1413,2813,4226,176,196,138,244,4608,33165,3817,3817,"",null,{"$f":"M578*100/M1331","v":4.3557168784029034},-94,7,13,196,3066,0.91710069444444442,2.9947916666666668E-2,5.2951388888888888E-2,{"$f":"L578*100/B$1285","v":8621.9081272084804}]
["2020-04-01T17:00:00",9,"Toscana",1120,297,1417,3015,4432,206,259,182,253,4867,36575,3817,3817,"",null,{"$f":"M579*100/M1332","v":4.4015772243022768},63,44,9,259,{"$f":"IF(N579-N578=0,\"\",N579-N578)","v":3410},{"$f":"IF(M579=0,0,H579/M579)","v":0.91062256009862341},{"$f":"IF(M579=0,0,K579/M579)","v":3.7394698993219642E-2},{"$f":"IF(M579=0,0,L579/M579)","v":5.1982740908156973E-2},{"$f":"L579*100/B$1285","v":8939.9293286219072}]
["2020-04-02T17:00:00",9,"Toscana",1135,295,1430,3359,4789,357,406,216,268,5273,40724,{"$f":"IF(P580=\"x2\",M580,O579)","v":3817},{"$f":"IF(M580>O579*2,\"x2\",O579)","v":3817},{"$f":"IF(P580=\"x2\",M580,\"\")","v":""},null,{"$f":"M580*100/M1333","v":4.5755887610419812},{"$f":"IF(J580-J579=0,\"\",J580-J579)","v":147},{"$f":"IF(K580-K579=0,\"\",K580-K579)","v":34},{"$f":"IF(L580-L579=0,\"\",L580-L579)","v":15},{"$f":"IF(M580-M579=0,\"\",M580-M579)","v":406},4149,0.90821164422529865,4.0963398444908025E-2,5.0824957329793287E-2,{"$f":"L580*100/B$1285","v":9469.9646643109536}]
["2020-04-03T17:00:00",9,"Toscana",1149,288,1437,3472,4909,120,226,300,290,5499,44460,{"$f":"IF(P581=\"x2\",M581,O580)","v":3817},{"$f":"IF(M581>O580*2,\"x2\",O580)","v":3817},{"$f":"IF(P581=\"x2\",M581,\"\")","v":""},null,{"$f":"M581*100/M1334","v":4.5891159755313913},{"$f":"IF(J581-J580=0,\"\",J581-J580)","v":-180},{"$f":"IF(K581-K580=0,\"\",K581-K580)","v":84},{"$f":"IF(L581-L580=0,\"\",L581-L580)","v":22},{"$f":"IF(M581-M580=0,\"\",M581-M580)","v":226},3736,0.8927077650481906,5.4555373704309872E-2,5.2736861247499545E-2,{"$f":"L581*100/B$1285","v":10247.349823321554}]
["2020-04-04T17:00:00",9,"Toscana",1129,286,1415,3639,5054,145,172,310,307,5671,47886,{"$f":"IF(P582=\"x2\",M582,O581)","v":3817},{"$f":"IF(M582>O581*2,\"x2\",O581)","v":3817},{"$f":"IF(P582=\"x2\",M582,\"\")","v":""},null,{"$f":"M582*100/M1335","v":4.5501957763656202},{"$f":"IF(J582-J581=0,\"\",J582-J581)","v":-54},{"$f":"IF(K582-K581=0,\"\",K582-K581)","v":10},{"$f":"IF(L582-L581=0,\"\",L582-L581)","v":17},{"$f":"IF(M582-M581=0,\"\",M582-M581)","v":172},3426,0.8912008464115676,5.4664080409098925E-2,5.413507317933345E-2,{"$f":"L582*100/B$1285","v":10848.056537102473}]
["2020-04-05T17:00:00",9,"Toscana",1111,276,1387,3798,5185,131,176,337,325,5847,51006,{"$f":"IF(P583=\"x2\",M583,O582)","v":3817},{"$f":"IF(M583>O582*2,\"x2\",O582)","v":3817},{"$f":"IF(P583=\"x2\",M583,\"\")","v":""},null,{"$f":"M583*100/M1336","v":4.5343859540279805},{"$f":"IF(J583-J582=0,\"\",J583-J582)","v":4},{"$f":"IF(K583-K582=0,\"\",K583-K582)","v":27},{"$f":"IF(L583-L582=0,\"\",L583-L582)","v":18},{"$f":"IF(M583-M582=0,\"\",M583-M582)","v":176},3120,0.88677954506584578,5.7636394732341369E-2,5.5584060201812897E-2,{"$f":"L583*100/B$1285","v":11484.098939929328}]
["2020-04-06T17:00:00",9,"Toscana",1116,279,1395,3906,5301,116,154,350,350,6001,52849,{"$f":"IF(P584=\"x2\",M584,O583)","v":3817},{"$f":"IF(M584>O583*2,\"x2\",O583)","v":3817},{"$f":"IF(P584=\"x2\",M584,\"\")","v":""},null,{"$f":"M584*100/M1337","v":4.5274506401502865},{"$f":"IF(J584-J583=0,\"\",J584-J583)","v":-22},{"$f":"IF(K584-K583=0,\"\",K584-K583)","v":13},{"$f":"IF(L584-L583=0,\"\",L584-L583)","v":25},{"$f":"IF(M584-M583=0,\"\",M584-M583)","v":154},1843,0.8833527745375771,5.8323612731211463E-2,5.8323612731211463E-2,{"$f":"L584*100/B$1285","v":12367.491166077738}]
["2020-04-07T17:00:00",9,"Toscana",1087,263,1350,4077,5427,126,172,377,369,6173,56651,{"$f":"IF(P585=\"x2\",M585,O584)","v":3817},{"$f":"IF(M585>O584*2,\"x2\",O584)","v":3817},{"$f":"IF(P585=\"x2\",M585,\"\")","v":""},null,{"$f":"M585*100/M1338","v":4.5528299381942086},{"$f":"IF(J585-J584=0,\"\",J585-J584)","v":18},{"$f":"IF(K585-K584=0,\"\",K585-K584)","v":27},{"$f":"IF(L585-L584=0,\"\",L585-L584)","v":19},{"$f":"IF(M585-M584=0,\"\",M585-M584)","v":172},{"$f":"IF(N585-N584=0,\"\",N585-N584)","v":3802},{"$f":"IF(M585=0,0,H585/M585)","v":0.8791511420703062},{"$f":"IF(M585=0,0,K585/M585)","v":6.1072412117284952E-2},{"$f":"IF(M585=0,0,L585/M585)","v":5.9776445812408881E-2},{"$f":"L585*100/B$1285","v":13038.86925795053}]
["2020-04-08T17:00:00",9,"Toscana",1066,260,1326,4231,5557,130,206,430,392,6379,60985,{"$f":"IF(P586=\"x2\",M586,O585)","v":3817},{"$f":"IF(M586>O585*2,\"x2\",O585)","v":3817},{"$f":"IF(P586=\"x2\",M586,\"\")","v":""},null,{"$f":"M586*100/M1339","v":4.575318099008765},{"$f":"IF(J586-J585=0,\"\",J586-J585)","v":34},{"$f":"IF(K586-K585=0,\"\",K586-K585)","v":53},{"$f":"IF(L586-L585=0,\"\",L586-L585)","v":23},{"$f":"IF(M586-M585=0,\"\",M586-M585)","v":206},{"$f":"IF(N586-N585=0,\"\",N586-N585)","v":4334},{"$f":"IF(M586=0,0,H586/M586)","v":0.87113967706537077},{"$f":"IF(M586=0,0,K586/M586)","v":6.7408684746825515E-2},{"$f":"IF(M586=0,0,L586/M586)","v":6.1451638187803734E-2},{"$f":"L586*100/B$1285","v":13851.590106007066}]
["2020-04-09T17:00:00",9,"Toscana",1038,256,1294,4409,5703,146,173,441,408,6552,65461,{"$f":"IF(P587=\"x2\",M587,O586)","v":3817},{"$f":"IF(M587>O586*2,\"x2\",O586)","v":3817},{"$f":"IF(P587=\"x2\",M587,\"\")","v":""},null,{"$f":"M587*100/M1340","v":4.5618481333463299},{"$f":"IF(J587-J586=0,\"\",J587-J586)","v":-33},{"$f":"IF(K587-K586=0,\"\",K587-K586)","v":11},{"$f":"IF(L587-L586=0,\"\",L587-L586)","v":16},{"$f":"IF(M587-M586=0,\"\",M587-M586)","v":173},{"$f":"IF(N587-N586=0,\"\",N587-N586)","v":4476},{"$f":"IF(M587=0,0,H587/M587)","v":0.87042124542124544},{"$f":"IF(M587=0,0,K587/M587)","v":6.7307692307692304E-2},{"$f":"IF(M587=0,0,L587/M587)","v":6.2271062271062272E-2},{"$f":"L587*100/B$1285","v":14416.961130742049}]
["2020-04-10T17:00:00",9,"Toscana",1011,256,1267,4555,5822,119,175,451,454,6727,72001,{"$f":"IF(P588=\"x2\",M588,O587)","v":3817},{"$f":"IF(M588>O587*2,\"x2\",O587)","v":3817},{"$f":"IF(P588=\"x2\",M588,\"\")","v":""},null,{"$f":"M588*100/M1341","v":4.5582983798288348},{"$f":"IF(J588-J587=0,\"\",J588-J587)","v":2},{"$f":"IF(K588-K587=0,\"\",K588-K587)","v":10},{"$f":"IF(L588-L587=0,\"\",L588-L587)","v":46},{"$f":"IF(M588-M587=0,\"\",M588-M587)","v":175},{"$f":"IF(N588-N587=0,\"\",N588-N587)","v":6540},{"$f":"IF(M588=0,0,H588/M588)","v":0.86546751895347107},{"$f":"IF(M588=0,0,K588/M588)","v":6.7043258510480153E-2},{"$f":"IF(M588=0,0,L588/M588)","v":6.7489222536048762E-2},{"$f":"L588*100/B$1285","v":16042.402826855123}]
["2020-04-11T17:00:00",9,"Toscana",997,237,1234,4758,5992,170,231,499,467,6958,75756,{"$f":"IF(P589=\"x2\",M589,O588)","v":3817},{"$f":"IF(M589>O588*2,\"x2\",O588)","v":3817},{"$f":"IF(P589=\"x2\",M589,\"\")","v":""},null,{"$f":"M589*100/M1342","v":4.5694846687813175},{"$f":"IF(J589-J588=0,\"\",J589-J588)","v":56},{"$f":"IF(K589-K588=0,\"\",K589-K588)","v":48},{"$f":"IF(L589-L588=0,\"\",L589-L588)","v":13},{"$f":"IF(M589-M588=0,\"\",M589-M588)","v":231},{"$f":"IF(N589-N588=0,\"\",N589-N588)","v":3755},{"$f":"IF(M589=0,0,H589/M589)","v":0.86116700201207241},{"$f":"IF(M589=0,0,K589/M589)","v":7.171601034780109E-2},{"$f":"IF(M589=0,0,L589/M589)","v":6.7116987640126469E-2},{"$f":"L589*100/B$1285","v":16501.766784452295}]
["2020-04-12T17:00:00",9,"Toscana",983,238,1221,4941,6162,170,277,578,495,7235,78640,{"$f":"IF(P590=\"x2\",M590,O589)","v":3817},{"$f":"IF(M590>O589*2,\"x2\",O589)","v":3817},{"$f":"IF(P590=\"x2\",M590,\"\")","v":""},null,{"$f":"M590*100/M1343","v":4.6270537147534903},{"$f":"IF(J590-J589=0,\"\",J590-J589)","v":46},{"$f":"IF(K590-K589=0,\"\",K590-K589)","v":79},{"$f":"IF(L590-L589=0,\"\",L590-L589)","v":28},{"$f":"IF(M590-M589=0,\"\",M590-M589)","v":277},{"$f":"IF(N590-N589=0,\"\",N590-N589)","v":2884},{"$f":"IF(M590=0,0,H590/M590)","v":0.85169315825846581},{"$f":"IF(M590=0,0,K590/M590)","v":7.9889426399447128E-2},{"$f":"IF(M590=0,0,L590/M590)","v":6.8417415342087076E-2},{"$f":"L590*100/B$1285","v":17491.166077738515}]
["2020-04-13T17:00:00",9,"Toscana",992,225,1217,5040,6257,95,155,615,518,7390,80889,{"$f":"IF(P591=\"x2\",M591,O590)","v":3817},{"$f":"IF(M591>O590*2,\"x2\",O590)","v":3817},{"$f":"IF(P591=\"x2\",M591,\"\")","v":""},null,{"$f":"M591*100/M1344","v":4.6327641114370977},{"$f":"IF(J591-J590=0,\"\",J591-J590)","v":-122},{"$f":"IF(K591-K590=0,\"\",K591-K590)","v":37},{"$f":"IF(L591-L590=0,\"\",L591-L590)","v":23},{"$f":"IF(M591-M590=0,\"\",M591-M590)","v":155},{"$f":"IF(N591-N590=0,\"\",N591-N590)","v":2249},{"$f":"IF(M591=0,0,H591/M591)","v":0.84668470906630577},{"$f":"IF(M591=0,0,K591/M591)","v":8.3220568335588635E-2},{"$f":"IF(M591=0,0,L591/M591)","v":7.0094722598105549E-2},{"$f":"L591*100/B$1285","v":18303.886925795054}]
["2020-04-14T17:00:00",9,"Toscana",1002,225,1227,5125,6352,95,137,637,538,7527,82269,{"$f":"IF(P592=\"x2\",M592,O591)","v":3817},{"$f":"IF(M592>O591*2,\"x2\",O591)","v":3817},{"$f":"IF(P592=\"x2\",M592,\"\")","v":""},null,{"$f":"M592*100/M1345","v":4.6323420806459552},{"$f":"IF(J592-J591=0,\"\",J592-J591)","v":-18},{"$f":"IF(K592-K591=0,\"\",K592-K591)","v":22},{"$f":"IF(L592-L591=0,\"\",L592-L591)","v":20},{"$f":"IF(M592-M591=0,\"\",M592-M591)","v":137},{"$f":"IF(N592-N591=0,\"\",N592-N591)","v":1380},{"$f":"IF(M592=0,0,H592/M592)","v":0.84389531021655373},{"$f":"IF(M592=0,0,K592/M592)","v":8.46286701208981E-2},{"$f":"IF(M592=0,0,L592/M592)","v":7.1476019662548157E-2},{"$f":"L592*100/B$1285","v":19010.60070671378}]
["2020-04-15T17:00:00",9,"Toscana",977,216,1193,5224,6417,65,139,693,556,7666,86348,{"$f":"IF(P593=\"x2\",M593,O592)","v":7666},{"$f":"IF(M593>O592*2,\"x2\",O592)","v":"x2"},{"$f":"IF(P593=\"x2\",M593,\"\")","v":7666},null,{"$f":"M593*100/M1346","v":4.6417002210045109},{"$f":"IF(J593-J592=0,\"\",J593-J592)","v":2},{"$f":"IF(K593-K592=0,\"\",K593-K592)","v":56},{"$f":"IF(L593-L592=0,\"\",L593-L592)","v":18},{"$f":"IF(M593-M592=0,\"\",M593-M592)","v":139},{"$f":"IF(N593-N592=0,\"\",N593-N592)","v":4079},{"$f":"IF(M593=0,0,H593/M593)","v":0.8370727889381685},{"$f":"IF(M593=0,0,K593/M593)","v":9.0399165144795193E-2},{"$f":"IF(M593=0,0,L593/M593)","v":7.2528045917036266E-2},{"$f":"L593*100/B$1285","v":19646.643109540637}]
[{"$f":"A593 + 1","v":"2020-04-16T17:00:00"},null,null,null,null,null,null,null,null,null,null,null,null,null,null,"Media x2",{"$f":"COUNT(M542:M593) / COUNT(Q542:Q593)","v":4.7272727272727275}]
[{"$f":"A594+1","v":"2020-04-17T17:00:00"}]
[{"$f":"A595+1","v":"2020-04-18T17:00:00"}]
[null,null,null,null,{"$f":"E593/$M593","v":2.8176363162014089E-2},null,null,{"$f":"H593/$M593","v":0.8370727889381685},null,null,{"$f":"K593/$M593","v":9.0399165144795193E-2},{"$f":"L593/$M593","v":7.2528045917036266E-2},null,{"$f":"N593/$M593","v":11.263762066266631}]
[]
[]
[]
["Data","Codice","Regione","Ricoverati","Terap. Intens.","Ospedalizzati","Quarantena","Positivi","+ Positivi","Nuovi","Guariti","Deceduti","Totale","Tamponi",null,null,"x 2",null,"% su Tot.","+ Nuovi","+ Guariti","+ Deceduti","+ Totali","+ Tamponi","% Positivi","% Guariti","% Deceduti","P. Stimati"]
["2020-02-24T18:00:00",10,"Umbria",0,0,0,0,0,0,0,0,0,0,0,{"$f":"M602","v":0},null,{"$f":"M602","v":0},null,{"$f":"M602*100/M1295","v":0},null,null,null,null,null,{"$f":"IF(M602=0,0,H602/M602)","v":0},{"$f":"IF(M602=0,0,K602/M602)","v":0},{"$f":"IF(M602=0,0,L602/M602)","v":0},{"$f":"L602*100/B$1285","v":0}]
["2020-02-25T18:00:00",10,"Umbria",0,0,0,0,0,0,0,0,0,0,8,{"$f":"IF(P603=\"x2\",M603,O602)","v":0},{"$f":"IF(M603>O602*2,\"x2\",O602)","v":0},{"$f":"IF(P603=\"x2\",M603,\"\")","v":""},null,{"$f":"M603*100/M1296","v":0},{"$f":"IF(J603-J602=0,\"\",J603-J602)","v":""},{"$f":"IF(K603-K602=0,\"\",K603-K602)","v":""},{"$f":"IF(L603-L602=0,\"\",L603-L602)","v":""},{"$f":"IF(M603-M602=0,\"\",M603-M602)","v":""},{"$f":"IF(N603-N602=0,\"\",N603-N602)","v":8},0,0,0,{"$f":"L603*100/B$1285","v":0}]
["2020-02-26T18:00:00",10,"Umbria",0,0,0,0,0,0,0,0,0,0,8,0,0,"",null,{"$f":"M604*100/M1297","v":0},"","","","","",0,0,0,{"$f":"L604*100/B$1285","v":0}]
["2020-02-27T18:00:00",10,"Umbria",0,0,0,0,0,0,0,0,0,0,8,0,0,"",null,{"$f":"M605*100/M1298","v":0},"","","","","",0,0,0,{"$f":"L605*100/B$1285","v":0}]
["2020-02-28T18:00:00",10,"Umbria",0,0,0,0,0,0,0,0,0,0,8,0,0,"",null,{"$f":"M606*100/M1299","v":0},"","","","","",0,0,0,{"$f":"L606*100/B$1285","v":0}]
["2020-02-29T17:00:00",10,"Umbria",0,0,0,0,0,0,0,0,0,0,31,0,0,"",null,{"$f":"M607*100/M1300","v":0},"","","","",23,0,0,0,{"$f":"L607*100/B$1285","v":0}]
["2020-03-01T17:00:00",10,"Umbria",0,0,0,2,2,2,2,0,0,2,35,2,"x2",2,null,{"$f":"M608*100/M1301","v":0.1180637544273908},2,"","",2,4,1,0,0,{"$f":"L608*100/B$1285","v":0}]
["2020-03-02T18:00:00",10,"Umbria",0,0,0,2,2,0,0,0,0,2,35,2,2,"",null,{"$f":"M609*100/M1302","v":9.8231827111984277E-2},-2,"","","","",1,0,0,{"$f":"L609*100/B$1285","v":0}]
["2020-03-03T18:00:00",10,"Umbria",1,1,2,6,8,6,6,0,0,8,45,8,"x2",8,null,{"$f":"M610*100/M1303","v":0.31974420463629094},6,"","",6,10,1,0,0,{"$f":"L610*100/B$1285","v":0}]
["2020-03-04T17:00:00",10,"Umbria",1,1,2,7,9,1,1,0,0,9,58,8,8,"",null,{"$f":"M611*100/M1304","v":0.29135642602784073},-5,"","",1,13,1,0,0,{"$f":"L611*100/B$1285","v":0}]
["2020-03-05T17:00:00",10,"Umbria",1,1,2,7,9,0,0,0,0,9,88,8,8,"",null,{"$f":"M612*100/M1305","v":0.23328149300155521},-1,"","","",30,1,0,0,{"$f":"L612*100/B$1285","v":0}]
["2020-03-06T17:00:00",10,"Umbria",2,2,4,12,16,7,7,0,0,16,110,8,8,"",null,{"$f":"M613*100/M1306","v":0.34512510785159622},7,"","",7,22,1,0,0,{"$f":"L613*100/B$1285","v":0}]
["2020-03-07T18:00:00",10,"Umbria",2,2,4,20,24,8,8,0,0,24,134,24,"x2",24,null,{"$f":"M614*100/M1307","v":0.40795512493625702},1,"","",8,24,1,0,0,{"$f":"L614*100/B$1285","v":0}]
["2020-03-08T18:00:00",10,"Umbria",2,2,4,22,26,2,2,0,0,26,168,24,24,"",null,{"$f":"M615*100/M1308","v":0.35254237288135593},-6,"","",2,34,1,0,0,{"$f":"L615*100/B$1285","v":0}]
["2020-03-09T18:00:00",10,"Umbria",4,2,6,22,28,2,2,0,0,28,183,24,24,"",null,{"$f":"M616*100/M1309","v":0.30527692978630616},"","","",2,15,1,0,0,{"$f":"L616*100/B$1285","v":0}]
["2020-03-10T18:00:00",10,"Umbria",8,2,10,27,37,9,9,0,0,37,260,24,24,"",null,{"$f":"M617*100/M1310","v":0.36456793772785495},7,"","",9,77,1,0,0,{"$f":"L617*100/B$1285","v":0}]
["2020-03-11T17:00:00",10,"Umbria",7,5,12,32,44,7,7,2,0,46,340,24,24,"",null,{"$f":"M618*100/M1311","v":0.36912213127908844},-2,2,"",9,80,0.95652173913043481,4.3478260869565216E-2,0,{"$f":"L618*100/B$1285","v":0}]
["2020-03-12T17:00:00",10,"Umbria",8,8,16,46,62,18,18,2,0,64,458,64,"x2",64,null,{"$f":"M619*100/M1312","v":0.42347647720505527},11,"","",18,118,0.96875,3.125E-2,0,{"$f":"L619*100/B$1285","v":0}]
["2020-03-13T17:00:00",10,"Umbria",11,10,21,52,73,11,11,2,1,76,576,64,64,"",null,{"$f":"M620*100/M1313","v":0.43035107587768967},-7,"",1,12,118,0.96052631578947367,2.6315789473684209E-2,1.3157894736842105E-2,{"$f":"L620*100/B$1285","v":35.335689045936398}]
["2020-03-14T17:00:00",10,"Umbria",21,11,32,71,103,30,30,3,1,107,748,64,64,"",null,{"$f":"M621*100/M1314","v":0.50574278016732055},19,1,"",31,172,0.96261682242990654,2.8037383177570093E-2,9.3457943925233638E-3,{"$f":"L621*100/B$1285","v":35.335689045936398}]
["2020-03-15T17:00:00",10,"Umbria",25,13,38,101,139,36,36,3,1,143,965,143,"x2",143,null,{"$f":"M622*100/M1315","v":0.57784781993777024},6,"","",36,217,0.97202797202797198,2.097902097902098E-2,6.993006993006993E-3,{"$f":"L622*100/B$1285","v":35.335689045936398}]
["2020-03-16T17:00:00",10,"Umbria",30,15,45,114,159,20,20,4,1,164,1093,143,143,"",null,{"$f":"M623*100/M1316","v":0.58613295210864902},-16,1,"",21,128,0.96951219512195119,2.4390243902439025E-2,6.0975609756097563E-3,{"$f":"L623*100/B$1285","v":35.335689045936398}]
["2020-03-17T17:00:00",10,"Umbria",36,21,57,135,192,33,33,4,1,197,1323,143,143,"",null,{"$f":"M624*100/M1317","v":0.62527772487780109},13,"","",33,230,0.97461928934010156,2.030456852791878E-2,5.076142131979695E-3,{"$f":"L624*100/B$1285","v":35.335689045936398}]
["2020-03-18T17:00:00",10,"Umbria",54,21,75,166,241,49,49,4,2,247,1601,143,143,"",null,{"$f":"M625*100/M1318","v":0.6916248984963459},16,"",1,50,278,0.97570850202429149,1.6194331983805668E-2,8.0971659919028341E-3,{"$f":"L625*100/B$1285","v":70.671378091872796}]
["2020-03-19T17:00:00",10,"Umbria",69,21,90,238,328,87,87,4,2,334,1954,334,"x2",334,null,{"$f":"M626*100/M1319","v":0.81393932009260384},38,"","",87,353,0.98203592814371254,1.1976047904191617E-2,5.9880239520958087E-3,{"$f":"L626*100/B$1285","v":70.671378091872796}]
["2020-03-20T17:00:00",10,"Umbria",75,24,99,285,384,56,56,4,7,395,2303,334,334,"",null,{"$f":"M627*100/M1320","v":0.84005019034048611},-31,"",5,61,{"$f":"IF(N627-N626=0,\"\",N627-N626)","v":349},0.97215189873417718,1.0126582278481013E-2,1.7721518987341773E-2,{"$f":"L627*100/B$1285","v":247.34982332155477}]
["2020-03-21T17:00:00",10,"Umbria",92,29,121,326,447,63,63,5,10,462,2712,334,334,"",null,{"$f":"M628*100/M1321","v":0.86229422524170374},7,1,3,{"$f":"IF(M628-M627=0,\"\",M628-M627)","v":67},409,0.96753246753246758,1.0822510822510822E-2,2.1645021645021644E-2,{"$f":"L628*100/B$1285","v":353.35689045936397}]
["2020-03-22T17:00:00",10,"Umbria",97,35,132,368,500,53,53,5,16,521,3135,334,334,"",null,{"$f":"M629*100/M1322","v":0.88099022625046497},-10,"",6,59,423,0.95969289827255277,9.5969289827255271E-3,3.0710172744721688E-2,{"$f":"L629*100/B$1285","v":565.37102473498237}]
["2020-03-23T17:00:00",10,"Umbria",106,42,148,408,556,56,56,5,16,577,3561,334,334,"",null,{"$f":"M630*100/M1323","v":0.90259201902169661},3,"","",56,426,0.96360485268630847,8.6655112651646445E-3,2.7729636048526862E-2,{"$f":"L630*100/B$1285","v":565.37102473498237}]
["2020-03-24T17:00:00",10,"Umbria",105,43,148,476,624,68,68,5,19,648,4108,334,334,"",null,{"$f":"M631*100/M1324","v":0.93674106626575693},12,"",3,71,547,0.96296296296296291,7.716049382716049E-3,2.9320987654320986E-2,{"$f":"L631*100/B$1285","v":671.37809187279152}]
["2020-03-25T17:00:00",10,"Umbria",123,44,167,519,686,62,62,5,19,710,4707,710,"x2",710,null,{"$f":"M632*100/M1325","v":0.95448068184873502},-6,"","",62,599,0.96619718309859159,7.0422535211267607E-3,2.6760563380281689E-2,{"$f":"L632*100/B$1285","v":671.37809187279152}]
["2020-03-26T17:00:00",10,"Umbria",144,46,190,580,770,84,84,12,20,802,5428,710,710,"",null,{"$f":"M633*100/M1326","v":0.99579085908690201},22,7,1,92,{"$f":"IF(N633-N632=0,\"\",N633-N632)","v":721},0.96009975062344144,1.4962593516209476E-2,2.4937655860349128E-2,{"$f":"L633*100/B$1285","v":706.71378091872793}]
["2020-03-27T17:00:00",10,"Umbria",149,46,195,629,824,54,82,39,21,884,6137,{"$f":"IF(P634=\"x2\",M634,O633)","v":710},{"$f":"IF(M634>O633*2,\"x2\",O633)","v":710},{"$f":"IF(P634=\"x2\",M634,\"\")","v":""},null,{"$f":"M634*100/M1327","v":1.0219889477213346},{"$f":"IF(J634-J633=0,\"\",J634-J633)","v":-2},27,1,82,709,0.9321266968325792,4.4117647058823532E-2,2.3755656108597284E-2,{"$f":"L634*100/B$1285","v":742.04946996466424}]
["2020-03-28T17:00:00",10,"Umbria",159,44,203,695,898,74,85,43,28,969,7028,710,710,"",null,{"$f":"M635*100/M1328","v":1.0478847651180898},3,4,7,85,891,0.9267285861713106,4.4375644994840042E-2,2.8895768833849329E-2,{"$f":"L635*100/B$1285","v":989.39929328621906}]
["2020-03-29T17:00:00",10,"Umbria",166,46,212,685,897,-1,54,95,31,1023,7685,710,710,"",null,{"$f":"M636*100/M1329","v":1.0472008107361115},-31,52,3,54,657,0.87683284457478006,9.2864125122189639E-2,3.0303030303030304E-2,{"$f":"L636*100/B$1285","v":1095.4063604240282}]
["2020-03-30T17:00:00",10,"Umbria",173,47,220,614,834,-63,28,184,33,1051,8150,710,710,"",null,{"$f":"M637*100/M1330","v":1.0330355124386912},-26,89,2,28,465,0.79352997145575643,0.17507136060894388,3.1398667935299718E-2,{"$f":"L637*100/B$1285","v":1166.077738515901}]
["2020-03-31T17:00:00",10,"Umbria",176,43,219,632,851,17,27,190,37,1078,8685,710,710,"",null,{"$f":"M638*100/M1331","v":1.0189806412583182},-1,6,4,27,535,0.78942486085343233,0.17625231910946196,3.4322820037105753E-2,{"$f":"L638*100/B$1285","v":1307.4204946996465}]
["2020-04-01T17:00:00",10,"Umbria",173,45,218,646,864,13,17,194,37,1095,9080,710,710,"",null,{"$f":"M639*100/M1332","v":0.99028704758804054},-10,4,"",17,{"$f":"IF(N639-N638=0,\"\",N639-N638)","v":395},{"$f":"IF(M639=0,0,H639/M639)","v":0.78904109589041094},{"$f":"IF(M639=0,0,K639/M639)","v":0.17716894977168951},{"$f":"IF(M639=0,0,L639/M639)","v":3.3789954337899546E-2},{"$f":"L639*100/B$1285","v":1307.4204946996465}]
["2020-04-02T17:00:00",10,"Umbria",171,47,218,667,885,21,33,205,38,1128,9737,{"$f":"IF(P640=\"x2\",M640,O639)","v":710},{"$f":"IF(M640>O639*2,\"x2\",O639)","v":710},{"$f":"IF(P640=\"x2\",M640,\"\")","v":""},null,{"$f":"M640*100/M1333","v":0.97880980892382985},{"$f":"IF(J640-J639=0,\"\",J640-J639)","v":16},{"$f":"IF(K640-K639=0,\"\",K640-K639)","v":11},{"$f":"IF(L640-L639=0,\"\",L640-L639)","v":1},{"$f":"IF(M640-M639=0,\"\",M640-M639)","v":33},657,0.78457446808510634,0.18173758865248227,3.3687943262411348E-2,{"$f":"L640*100/B$1285","v":1342.756183745583}]
["2020-04-03T17:00:00",10,"Umbria",165,48,213,707,920,35,51,220,39,1179,10614,{"$f":"IF(P641=\"x2\",M641,O640)","v":710},{"$f":"IF(M641>O640*2,\"x2\",O640)","v":710},{"$f":"IF(P641=\"x2\",M641,\"\")","v":""},null,{"$f":"M641*100/M1334","v":0.98391848247890712},{"$f":"IF(J641-J640=0,\"\",J641-J640)","v":18},{"$f":"IF(K641-K640=0,\"\",K641-K640)","v":15},{"$f":"IF(L641-L640=0,\"\",L641-L640)","v":1},{"$f":"IF(M641-M640=0,\"\",M641-M640)","v":51},877,0.78032230703986427,0.18659881255301103,3.3078880407124679E-2,{"$f":"L641*100/B$1285","v":1378.0918727915193}]
["2020-04-04T17:00:00",10,"Umbria",167,44,211,716,927,7,31,242,41,1210,11809,{"$f":"IF(P642=\"x2\",M642,O641)","v":710},{"$f":"IF(M642>O641*2,\"x2\",O641)","v":710},{"$f":"IF(P642=\"x2\",M642,\"\")","v":""},null,{"$f":"M642*100/M1335","v":0.97085820656011301},{"$f":"IF(J642-J641=0,\"\",J642-J641)","v":-20},{"$f":"IF(K642-K641=0,\"\",K642-K641)","v":22},{"$f":"IF(L642-L641=0,\"\",L642-L641)","v":2},{"$f":"IF(M642-M641=0,\"\",M642-M641)","v":31},1195,0.7661157024793388,0.2,3.3884297520661154E-2,{"$f":"L642*100/B$1285","v":1448.7632508833922}]
["2020-04-05T17:00:00",10,"Umbria",159,45,204,694,898,-29,29,298,43,1239,12448,{"$f":"IF(P643=\"x2\",M643,O642)","v":710},{"$f":"IF(M643>O642*2,\"x2\",O642)","v":710},{"$f":"IF(P643=\"x2\",M643,\"\")","v":""},null,{"$f":"M643*100/M1336","v":0.96085243664112663},{"$f":"IF(J643-J642=0,\"\",J643-J642)","v":-2},{"$f":"IF(K643-K642=0,\"\",K643-K642)","v":56},{"$f":"IF(L643-L642=0,\"\",L643-L642)","v":2},{"$f":"IF(M643-M642=0,\"\",M643-M642)","v":29},639,0.72477804681194513,0.24051654560129138,3.470540758676352E-2,{"$f":"L643*100/B$1285","v":1519.434628975265}]
["2020-04-06T17:00:00",10,"Umbria",159,46,205,667,872,-26,14,337,44,1253,12573,{"$f":"IF(P644=\"x2\",M644,O643)","v":710},{"$f":"IF(M644>O643*2,\"x2\",O643)","v":710},{"$f":"IF(P644=\"x2\",M644,\"\")","v":""},null,{"$f":"M644*100/M1337","v":0.94532505450896664},{"$f":"IF(J644-J643=0,\"\",J644-J643)","v":-15},{"$f":"IF(K644-K643=0,\"\",K644-K643)","v":39},{"$f":"IF(L644-L643=0,\"\",L644-L643)","v":1},{"$f":"IF(M644-M643=0,\"\",M644-M643)","v":14},125,0.69592976855546684,0.26895450917797287,3.5115722266560255E-2,{"$f":"L644*100/B$1285","v":1554.7703180212013}]
["2020-04-07T17:00:00",10,"Umbria",157,41,198,648,846,-26,10,368,49,1263,13274,{"$f":"IF(P645=\"x2\",M645,O644)","v":710},{"$f":"IF(M645>O644*2,\"x2\",O644)","v":710},{"$f":"IF(P645=\"x2\",M645,\"\")","v":""},null,{"$f":"M645*100/M1338","v":0.93151210301948584},{"$f":"IF(J645-J644=0,\"\",J645-J644)","v":-4},{"$f":"IF(K645-K644=0,\"\",K645-K644)","v":31},{"$f":"IF(L645-L644=0,\"\",L645-L644)","v":5},{"$f":"IF(M645-M644=0,\"\",M645-M644)","v":10},{"$f":"IF(N645-N644=0,\"\",N645-N644)","v":701},{"$f":"IF(M645=0,0,H645/M645)","v":0.66983372921615203},{"$f":"IF(M645=0,0,K645/M645)","v":0.2913697545526524},{"$f":"IF(M645=0,0,L645/M645)","v":3.8796516231195566E-2},{"$f":"L645*100/B$1285","v":1731.4487632508833}]
["2020-04-08T17:00:00",10,"Umbria",155,41,196,627,823,-23,26,416,50,1289,14105,{"$f":"IF(P646=\"x2\",M646,O645)","v":710},{"$f":"IF(M646>O645*2,\"x2\",O645)","v":710},{"$f":"IF(P646=\"x2\",M646,\"\")","v":""},null,{"$f":"M646*100/M1339","v":0.92453127913815614},{"$f":"IF(J646-J645=0,\"\",J646-J645)","v":16},{"$f":"IF(K646-K645=0,\"\",K646-K645)","v":48},{"$f":"IF(L646-L645=0,\"\",L646-L645)","v":1},{"$f":"IF(M646-M645=0,\"\",M646-M645)","v":26},{"$f":"IF(N646-N645=0,\"\",N646-N645)","v":831},{"$f":"IF(M646=0,0,H646/M646)","v":0.63847944142746316},{"$f":"IF(M646=0,0,K646/M646)","v":0.32273079906904578},{"$f":"IF(M646=0,0,L646/M646)","v":3.8789759503491075E-2},{"$f":"L646*100/B$1285","v":1766.7844522968198}]
["2020-04-09T17:00:00",10,"Umbria",154,38,192,600,792,-31,9,455,51,1298,15170,{"$f":"IF(P647=\"x2\",M647,O646)","v":710},{"$f":"IF(M647>O646*2,\"x2\",O646)","v":710},{"$f":"IF(P647=\"x2\",M647,\"\")","v":""},null,{"$f":"M647*100/M1340","v":0.90373609235096708},{"$f":"IF(J647-J646=0,\"\",J647-J646)","v":-17},{"$f":"IF(K647-K646=0,\"\",K647-K646)","v":39},{"$f":"IF(L647-L646=0,\"\",L647-L646)","v":1},{"$f":"IF(M647-M646=0,\"\",M647-M646)","v":9},{"$f":"IF(N647-N646=0,\"\",N647-N646)","v":1065},{"$f":"IF(M647=0,0,H647/M647)","v":0.61016949152542377},{"$f":"IF(M647=0,0,K647/M647)","v":0.3505392912172573},{"$f":"IF(M647=0,0,L647/M647)","v":3.9291217257318954E-2},{"$f":"L647*100/B$1285","v":1802.1201413427561}]
["2020-04-10T17:00:00",10,"Umbria",146,39,185,567,752,-40,4,498,52,1302,16325,{"$f":"IF(P648=\"x2\",M648,O647)","v":710},{"$f":"IF(M648>O647*2,\"x2\",O647)","v":710},{"$f":"IF(P648=\"x2\",M648,\"\")","v":""},null,{"$f":"M648*100/M1341","v":0.88225129932170998},{"$f":"IF(J648-J647=0,\"\",J648-J647)","v":-5},{"$f":"IF(K648-K647=0,\"\",K648-K647)","v":43},{"$f":"IF(L648-L647=0,\"\",L648-L647)","v":1},{"$f":"IF(M648-M647=0,\"\",M648-M647)","v":4},{"$f":"IF(N648-N647=0,\"\",N648-N647)","v":1155},{"$f":"IF(M648=0,0,H648/M648)","v":0.57757296466973884},{"$f":"IF(M648=0,0,K648/M648)","v":0.38248847926267282},{"$f":"IF(M648=0,0,L648/M648)","v":3.9938556067588324E-2},{"$f":"L648*100/B$1285","v":1837.4558303886924}]
["2020-04-11T17:00:00",10,"Umbria",137,39,176,547,723,-29,7,534,52,1309,17661,{"$f":"IF(P649=\"x2\",M649,O648)","v":710},{"$f":"IF(M649>O648*2,\"x2\",O648)","v":710},{"$f":"IF(P649=\"x2\",M649,\"\")","v":""},null,{"$f":"M649*100/M1342","v":0.85965154231600238},{"$f":"IF(J649-J648=0,\"\",J649-J648)","v":3},{"$f":"IF(K649-K648=0,\"\",K649-K648)","v":36},{"$f":"IF(L649-L648=0,\"\",L649-L648)","v":""},{"$f":"IF(M649-M648=0,\"\",M649-M648)","v":7},{"$f":"IF(N649-N648=0,\"\",N649-N648)","v":1336},{"$f":"IF(M649=0,0,H649/M649)","v":0.55233002291825817},{"$f":"IF(M649=0,0,K649/M649)","v":0.40794499618029029},{"$f":"IF(M649=0,0,L649/M649)","v":3.972498090145149E-2},{"$f":"L649*100/B$1285","v":1837.4558303886924}]
["2020-04-12T17:00:00",10,"Umbria",129,39,168,519,687,-36,10,580,52,1319,18672,{"$f":"IF(P650=\"x2\",M650,O649)","v":710},{"$f":"IF(M650>O649*2,\"x2\",O649)","v":710},{"$f":"IF(P650=\"x2\",M650,\"\")","v":""},null,{"$f":"M650*100/M1343","v":0.84354994468000744},{"$f":"IF(J650-J649=0,\"\",J650-J649)","v":3},{"$f":"IF(K650-K649=0,\"\",K650-K649)","v":46},{"$f":"IF(L650-L649=0,\"\",L650-L649)","v":""},{"$f":"IF(M650-M649=0,\"\",M650-M649)","v":10},{"$f":"IF(N650-N649=0,\"\",N650-N649)","v":1011},{"$f":"IF(M650=0,0,H650/M650)","v":0.52084912812736917},{"$f":"IF(M650=0,0,K650/M650)","v":0.43972706595905992},{"$f":"IF(M650=0,0,L650/M650)","v":3.9423805913570885E-2},{"$f":"L650*100/B$1285","v":1837.4558303886924}]
["2020-04-13T17:00:00",10,"Umbria",127,38,165,460,625,-62,1,643,52,1320,18740,{"$f":"IF(P651=\"x2\",M651,O650)","v":710},{"$f":"IF(M651>O650*2,\"x2\",O650)","v":710},{"$f":"IF(P651=\"x2\",M651,\"\")","v":""},null,{"$f":"M651*100/M1344","v":0.82750319717144361},{"$f":"IF(J651-J650=0,\"\",J651-J650)","v":-9},{"$f":"IF(K651-K650=0,\"\",K651-K650)","v":63},{"$f":"IF(L651-L650=0,\"\",L651-L650)","v":""},{"$f":"IF(M651-M650=0,\"\",M651-M650)","v":1},{"$f":"IF(N651-N650=0,\"\",N651-N650)","v":68},{"$f":"IF(M651=0,0,H651/M651)","v":0.47348484848484851},{"$f":"IF(M651=0,0,K651/M651)","v":0.48712121212121212},{"$f":"IF(M651=0,0,L651/M651)","v":3.9393939393939391E-2},{"$f":"L651*100/B$1285","v":1837.4558303886924}]
["2020-04-14T17:00:00",10,"Umbria",127,37,164,458,622,-3,1,646,53,1321,18956,{"$f":"IF(P652=\"x2\",M652,O651)","v":710},{"$f":"IF(M652>O651*2,\"x2\",O651)","v":710},{"$f":"IF(P652=\"x2\",M652,\"\")","v":""},null,{"$f":"M652*100/M1345","v":0.81298311259908429},{"$f":"IF(J652-J651=0,\"\",J652-J651)","v":""},{"$f":"IF(K652-K651=0,\"\",K652-K651)","v":3},{"$f":"IF(L652-L651=0,\"\",L652-L651)","v":1},{"$f":"IF(M652-M651=0,\"\",M652-M651)","v":1},{"$f":"IF(N652-N651=0,\"\",N652-N651)","v":216},{"$f":"IF(M652=0,0,H652/M652)","v":0.4708554125662377},{"$f":"IF(M652=0,0,K652/M652)","v":0.48902346707040123},{"$f":"IF(M652=0,0,L652/M652)","v":4.0121120363361087E-2},{"$f":"L652*100/B$1285","v":1872.791519434629}]
["2020-04-15T17:00:00",10,"Umbria",122,37,159,423,582,-40,1,686,54,1322,20258,{"$f":"IF(P653=\"x2\",M653,O652)","v":710},{"$f":"IF(M653>O652*2,\"x2\",O652)","v":710},{"$f":"IF(P653=\"x2\",M653,\"\")","v":""},null,{"$f":"M653*100/M1346","v":0.80046017377614964},{"$f":"IF(J653-J652=0,\"\",J653-J652)","v":""},{"$f":"IF(K653-K652=0,\"\",K653-K652)","v":40},{"$f":"IF(L653-L652=0,\"\",L653-L652)","v":1},{"$f":"IF(M653-M652=0,\"\",M653-M652)","v":1},{"$f":"IF(N653-N652=0,\"\",N653-N652)","v":1302},{"$f":"IF(M653=0,0,H653/M653)","v":0.44024205748865358},{"$f":"IF(M653=0,0,K653/M653)","v":0.51891074130105896},{"$f":"IF(M653=0,0,L653/M653)","v":4.084720121028744E-2},{"$f":"L653*100/B$1285","v":1908.1272084805653}]
[{"$f":"A653 + 1","v":"2020-04-16T17:00:00"},null,null,null,null,null,null,null,null,null,null,null,null,null,null,"Media x2",{"$f":"COUNT(M602:M653) / COUNT(Q602:Q653)","v":6.5}]
[{"$f":"A654+1","v":"2020-04-17T17:00:00"}]
[{"$f":"A655+1","v":"2020-04-18T17:00:00"}]
[null,null,null,null,{"$f":"E653/$M653","v":2.7987897125567322E-2},null,null,{"$f":"H653/$M653","v":0.44024205748865358},null,null,{"$f":"K653/$M653","v":0.51891074130105896},{"$f":"L653/$M653","v":4.084720121028744E-2},null,{"$f":"N653/$M653","v":15.32375189107413}]
[]
[]
[]
["Data","Codice","Regione","Ricoverati","Terap. Intens.","Ospedalizzati","Quarantena","Positivi","+ Positivi","Nuovi","Guariti","Deceduti","Totale","Tamponi",null,null,"x 2",null,"% su Tot.","+ Nuovi","+ Guariti","+ Deceduti","+ Totali","+ Tamponi","% Positivi","% Guariti","% Deceduti","P. Stimati"]
["2020-02-24T18:00:00",11,"Marche",0,0,0,0,0,0,0,0,0,0,16,{"$f":"M662","v":0},null,{"$f":"M662","v":0},null,{"$f":"M662*100/M1295","v":0},null,null,null,null,null,{"$f":"IF(M662=0,0,H662/M662)","v":0},{"$f":"IF(M662=0,0,K662/M662)","v":0},{"$f":"IF(M662=0,0,L662/M662)","v":0},{"$f":"L662*100/B$1285","v":0}]
["2020-02-25T18:00:00",11,"Marche",0,0,0,0,0,0,0,0,0,0,21,{"$f":"IF(P663=\"x2\",M663,O662)","v":0},{"$f":"IF(M663>O662*2,\"x2\",O662)","v":0},{"$f":"IF(P663=\"x2\",M663,\"\")","v":""},null,{"$f":"M663*100/M1296","v":0},{"$f":"IF(J663-J662=0,\"\",J663-J662)","v":""},{"$f":"IF(K663-K662=0,\"\",K663-K662)","v":""},{"$f":"IF(L663-L662=0,\"\",L663-L662)","v":""},{"$f":"IF(M663-M662=0,\"\",M663-M662)","v":""},{"$f":"IF(N663-N662=0,\"\",N663-N662)","v":5},0,0,0,{"$f":"L663*100/B$1285","v":0}]
["2020-02-26T18:00:00",11,"Marche",1,0,1,0,1,1,1,0,0,1,28,1,"x2",1,null,{"$f":"M664*100/M1297","v":0.25},1,"","",1,7,1,0,0,{"$f":"L664*100/B$1285","v":0}]
["2020-02-27T18:00:00",11,"Marche",2,1,3,0,3,2,2,0,0,3,46,3,"x2",3,null,{"$f":"M665*100/M1298","v":0.46153846153846156},1,"","",2,18,1,0,0,{"$f":"L665*100/B$1285","v":0}]
["2020-02-28T18:00:00",11,"Marche",3,2,5,1,6,3,3,0,0,6,47,3,3,"",null,{"$f":"M666*100/M1299","v":0.67567567567567566},1,"","",3,1,1,0,0,{"$f":"L666*100/B$1285","v":0}]
["2020-02-29T17:00:00",11,"Marche",6,2,8,3,11,5,5,0,0,11,68,11,"x2",11,null,{"$f":"M667*100/M1300","v":0.97517730496453903},2,"","",5,21,1,0,0,{"$f":"L667*100/B$1285","v":0}]
["2020-03-01T17:00:00",11,"Marche",12,5,17,8,25,14,14,0,0,25,101,25,"x2",25,null,{"$f":"M668*100/M1301","v":1.4757969303423848},9,"","",14,33,1,0,0,{"$f":"L668*100/B$1285","v":0}]
["2020-03-02T18:00:00",11,"Marche",17,6,23,11,34,9,9,0,1,35,137,25,25,"",null,{"$f":"M669*100/M1302","v":1.7190569744597251},-5,"",1,10,36,0.97142857142857142,0,2.8571428571428571E-2,{"$f":"L669*100/B$1285","v":35.335689045936398}]
["2020-03-03T18:00:00",11,"Marche",27,13,40,19,59,25,25,0,2,61,200,61,"x2",61,null,{"$f":"M670*100/M1303","v":2.4380495603517187},16,"",1,26,63,0.96721311475409832,0,3.2786885245901641E-2,{"$f":"L670*100/B$1285","v":70.671378091872796}]
["2020-03-04T17:00:00",11,"Marche",34,15,49,31,80,21,21,0,4,84,288,61,61,"",null,{"$f":"M671*100/M1304","v":2.7193266429265135},-4,"",2,23,88,0.95238095238095233,0,4.7619047619047616E-2,{"$f":"L671*100/B$1285","v":141.34275618374559}]
["2020-03-05T17:00:00",11,"Marche",57,19,76,44,120,40,40,0,4,124,413,124,"x2",124,null,{"$f":"M672*100/M1305","v":3.2141005702436494},19,"","",40,125,0.967741935483871,0,3.2258064516129031E-2,{"$f":"L672*100/B$1285","v":141.34275618374559}]
["2020-03-06T17:00:00",11,"Marche",73,20,93,62,155,35,35,0,4,159,585,124,124,"",null,{"$f":"M673*100/M1306","v":3.4296807592752372},-5,"","",35,172,0.97484276729559749,0,2.5157232704402517E-2,{"$f":"L673*100/B$1285","v":141.34275618374559}]
["2020-03-07T18:00:00",11,"Marche",94,36,130,71,201,46,46,0,6,207,816,124,124,"",null,{"$f":"M674*100/M1307","v":3.5186129525752166},11,"",2,48,231,0.97101449275362317,0,2.8985507246376812E-2,{"$f":"L674*100/B$1285","v":212.01413427561837}]
["2020-03-08T18:00:00",11,"Marche",110,41,151,114,265,64,64,0,7,272,1025,272,"x2",272,null,{"$f":"M675*100/M1308","v":3.688135593220339},18,"",1,65,209,0.97426470588235292,0,2.5735294117647058E-2,{"$f":"L675*100/B$1285","v":247.34982332155477}]
["2020-03-09T18:00:00",11,"Marche",136,47,183,130,313,48,48,0,10,323,1250,272,272,"",null,{"$f":"M676*100/M1309","v":3.5215874400348888},-16,"",3,51,225,0.96904024767801855,0,3.0959752321981424E-2,{"$f":"L676*100/B$1285","v":353.35689045936397}]
["2020-03-10T18:00:00",11,"Marche",152,54,206,175,381,68,68,0,13,394,1437,272,272,"",null,{"$f":"M677*100/M1310","v":3.8821558774263476},20,"",3,71,187,0.96700507614213194,0,3.2994923857868022E-2,{"$f":"L677*100/B$1285","v":459.36395759717311}]
["2020-03-11T17:00:00",11,"Marche",212,66,278,183,461,80,80,0,18,479,1656,272,272,"",null,{"$f":"M678*100/M1311","v":3.8436848017974641},12,"",5,85,219,0.9624217118997912,0,3.7578288100208766E-2,{"$f":"L678*100/B$1285","v":636.0424028268551}]
["2020-03-12T17:00:00",11,"Marche",254,76,330,240,570,109,109,0,22,592,1907,592,"x2",592,null,{"$f":"M679*100/M1312","v":3.9171574141467609},29,"",4,113,251,0.96283783783783783,0,3.7162162162162164E-2,{"$f":"L679*100/B$1285","v":777.38515901060066}]
["2020-03-13T17:00:00",11,"Marche",337,85,422,276,698,128,128,0,27,725,2218,592,592,"",null,{"$f":"M680*100/M1313","v":4.1053227633069085},19,"",5,133,311,0.96275862068965512,0,3.7241379310344824E-2,{"$f":"L680*100/B$1285","v":954.06360424028264}]
["2020-03-14T17:00:00",11,"Marche",449,93,542,321,863,165,165,0,36,899,2561,592,592,"",null,{"$f":"M681*100/M1314","v":4.2491846670132816},37,"",9,174,343,0.95995550611790881,0,4.0044493882091213E-2,{"$f":"L681*100/B$1285","v":1272.0848056537102}]
["2020-03-15T17:00:00",11,"Marche",521,98,619,468,1087,224,224,0,46,1133,2946,592,592,"",null,{"$f":"M682*100/M1315","v":4.5783327271992569},59,"",10,234,385,0.95939982347749342,0,4.0600176522506623E-2,{"$f":"L682*100/B$1285","v":1625.4416961130742}]
["2020-03-16T17:00:00",11,"Marche",528,110,638,547,1185,98,98,0,57,1242,3225,1242,"x2",1242,null,{"$f":"M683*100/M1316","v":4.4388849177984273},-126,"",11,109,279,0.95410628019323673,0,4.5893719806763288E-2,{"$f":"L683*100/B$1285","v":2014.1342756183744}]
["2020-03-17T17:00:00",11,"Marche",599,109,708,594,1302,117,117,0,69,1371,3225,1242,1242,"",null,{"$f":"M684*100/M1317","v":4.3515520853170822},19,"",12,129,"",0.94967177242888401,0,5.0328227571115977E-2,{"$f":"L684*100/B$1285","v":2438.1625441696115}]
["2020-03-18T17:00:00",11,"Marche",638,119,757,719,1476,174,174,0,92,1568,4109,1242,1242,"",null,{"$f":"M685*100/M1318","v":4.3905580600901635},57,"",23,197,884,0.94132653061224492,0,5.8673469387755105E-2,{"$f":"L685*100/B$1285","v":3250.8833922261483}]
["2020-03-19T17:00:00",11,"Marche",656,141,797,825,1622,146,146,0,115,1737,4512,1242,1242,"",null,{"$f":"M686*100/M1319","v":4.2329718532959673},-28,"",23,169,403,0.93379389752446751,0,6.6206102475532533E-2,{"$f":"L686*100/B$1285","v":4063.6042402826856}]
["2020-03-20T17:00:00",11,"Marche",704,138,842,1002,1844,222,222,0,137,1981,5170,1242,1242,"",null,{"$f":"M687*100/M1320","v":4.2130112077582353},76,"",22,244,{"$f":"IF(N687-N686=0,\"\",N687-N686)","v":658},0.93084300858152447,0,6.9156991418475519E-2,{"$f":"L687*100/B$1285","v":4840.9893992932857}]
["2020-03-21T17:00:00",11,"Marche",742,141,883,1114,1997,153,153,2,154,2153,5740,1242,1242,"",null,{"$f":"M688*100/M1321","v":4.0184404046436972},-69,2,17,{"$f":"IF(M688-M687=0,\"\",M688-M687)","v":172},570,0.92754296330701347,9.2893636785880169E-4,7.1528100325127728E-2,{"$f":"L688*100/B$1285","v":5441.6961130742047}]
["2020-03-22T17:00:00",11,"Marche",816,138,954,1277,2231,234,234,6,184,2421,6391,1242,1242,"",null,{"$f":"M689*100/M1322","v":4.0938144678548483},81,4,30,268,651,0.92152003304419661,2.4783147459727386E-3,7.6001652209830642E-2,{"$f":"L689*100/B$1285","v":6501.7667844522966}]
["2020-03-23T17:00:00",11,"Marche",882,148,1030,1328,2358,127,127,8,203,2569,6782,2569,"x2",2569,null,{"$f":"M690*100/M1323","v":4.0186462683998938},-107,2,19,148,391,0.91786687427014402,3.1140521603736861E-3,7.901907356948229E-2,{"$f":"L690*100/B$1285","v":7173.1448763250883}]
["2020-03-24T17:00:00",11,"Marche",862,149,1011,1486,2497,139,139,8,231,2736,7229,2569,2569,"",null,{"$f":"M691*100/M1324","v":3.9551289464554182},12,"",28,167,447,0.91264619883040932,2.9239766081871343E-3,8.4429824561403508E-2,{"$f":"L691*100/B$1285","v":8162.5441696113076}]
["2020-03-25T17:00:00",11,"Marche",938,148,1086,1553,2639,142,142,8,287,2934,7896,2569,2569,"",null,{"$f":"M692*100/M1325","v":3.9442905923157583},3,"",56,198,667,0.89945466939331975,2.7266530334014998E-3,9.7818677573278806E-2,{"$f":"L692*100/B$1285","v":10141.342756183745}]
["2020-03-26T17:00:00",11,"Marche",977,166,1143,1652,2795,156,156,9,310,3114,8623,2569,2569,"",null,{"$f":"M693*100/M1326","v":3.8664497945094922},14,1,23,180,{"$f":"IF(N693-N692=0,\"\",N693-N692)","v":727},0.89755940912010279,2.8901734104046241E-3,9.9550417469492614E-2,{"$f":"L693*100/B$1285","v":10954.063604240282}]
["2020-03-27T17:00:00",11,"Marche",979,162,1141,1709,2850,55,82,10,336,3196,9060,{"$f":"IF(P694=\"x2\",M694,O693)","v":2569},{"$f":"IF(M694>O693*2,\"x2\",O693)","v":2569},{"$f":"IF(P694=\"x2\",M694,\"\")","v":""},null,{"$f":"M694*100/M1327","v":3.694883118684825},{"$f":"IF(J694-J693=0,\"\",J694-J693)","v":-74},1,26,82,437,0.89173967459324155,3.1289111389236545E-3,0.10513141426783479,{"$f":"L694*100/B$1285","v":11872.791519434628}]
["2020-03-28T17:00:00",11,"Marche",987,166,1153,1846,2999,149,177,10,364,3373,9884,2569,2569,"",null,{"$f":"M695*100/M1328","v":3.6475906220261267},95,"",28,177,824,0.88911947820930926,2.9647198339756895E-3,0.10791580195671509,{"$f":"L695*100/B$1285","v":12862.190812720848}]
["2020-03-29T17:00:00",11,"Marche",1000,168,1168,1992,3160,161,185,12,386,3558,10431,2569,2569,"",null,{"$f":"M696*100/M1329","v":3.6421705616804347},8,2,22,185,547,0.88813940415964021,3.3726812816188868E-3,0.10848791455874086,{"$f":"L696*100/B$1285","v":13639.575971731449}]
["2020-03-30T17:00:00",11,"Marche",998,167,1165,2086,3251,91,126,16,417,3684,10979,2569,2569,"",null,{"$f":"M697*100/M1330","v":3.6210302833721584},-59,4,31,126,548,0.88246471226927248,4.3431053203040176E-3,0.11319218241042345,{"$f":"L697*100/B$1285","v":14734.982332155476}]
["2020-03-31T17:00:00",11,"Marche",946,169,1115,2237,3352,101,141,21,452,3825,11724,2569,2569,"",null,{"$f":"M698*100/M1331","v":3.6155852994555353},15,5,35,141,745,0.87633986928104579,5.4901960784313726E-3,0.11816993464052288,{"$f":"L698*100/B$1285","v":15971.73144876325}]
["2020-04-01T17:00:00",11,"Marche",984,168,1152,2304,3456,104,137,29,477,3962,12296,2569,2569,"",null,{"$f":"M699*100/M1332","v":3.5831208059760886},-4,8,25,137,{"$f":"IF(N699-N698=0,\"\",N699-N698)","v":572},{"$f":"IF(M699=0,0,H699/M699)","v":0.87228672387682993},{"$f":"IF(M699=0,0,K699/M699)","v":7.3195355880868252E-3},{"$f":"IF(M699=0,0,L699/M699)","v":0.1203937405350833},{"$f":"L699*100/B$1285","v":16855.123674911662}]
["2020-04-02T17:00:00",11,"Marche",986,164,1150,2405,3555,99,136,40,503,4098,12943,{"$f":"IF(P700=\"x2\",M700,O699)","v":2569},{"$f":"IF(M700>O699*2,\"x2\",O699)","v":2569},{"$f":"IF(P700=\"x2\",M700,\"\")","v":""},null,{"$f":"M700*100/M1333","v":3.5559952100796584},{"$f":"IF(J700-J699=0,\"\",J700-J699)","v":-1},{"$f":"IF(K700-K699=0,\"\",K700-K699)","v":11},{"$f":"IF(L700-L699=0,\"\",L700-L699)","v":26},{"$f":"IF(M700-M699=0,\"\",M700-M699)","v":136},647,0.86749633967789164,9.760858955588092E-3,0.12274280136652026,{"$f":"L700*100/B$1285","v":17773.851590106005}]
["2020-04-03T17:00:00",11,"Marche",982,158,1140,2491,3631,76,132,42,557,4230,13678,{"$f":"IF(P701=\"x2\",M701,O700)","v":2569},{"$f":"IF(M701>O700*2,\"x2\",O700)","v":2569},{"$f":"IF(P701=\"x2\",M701,\"\")","v":""},null,{"$f":"M701*100/M1334","v":3.530089211947224},{"$f":"IF(J701-J700=0,\"\",J701-J700)","v":-4},{"$f":"IF(K701-K700=0,\"\",K701-K700)","v":2},{"$f":"IF(L701-L700=0,\"\",L701-L700)","v":54},{"$f":"IF(M701-M700=0,\"\",M701-M700)","v":132},735,0.85839243498817963,9.9290780141843976E-3,0.13167848699763593,{"$f":"L701*100/B$1285","v":19681.978798586573}]
["2020-04-04T17:00:00",11,"Marche",997,153,1150,2347,3497,-134,111,270,574,4341,14472,{"$f":"IF(P702=\"x2\",M702,O701)","v":2569},{"$f":"IF(M702>O701*2,\"x2\",O701)","v":2569},{"$f":"IF(P702=\"x2\",M702,\"\")","v":""},null,{"$f":"M702*100/M1335","v":3.4830541113036779},{"$f":"IF(J702-J701=0,\"\",J702-J701)","v":-21},{"$f":"IF(K702-K701=0,\"\",K702-K701)","v":228},{"$f":"IF(L702-L701=0,\"\",L702-L701)","v":17},{"$f":"IF(M702-M701=0,\"\",M702-M701)","v":111},794,0.80557475236120712,6.2197650310988249E-2,0.13222759732780465,{"$f":"L702*100/B$1285","v":20282.68551236749}]
["2020-04-05T17:00:00",11,"Marche",987,151,1138,2440,3578,81,123,287,599,4464,15252,{"$f":"IF(P703=\"x2\",M703,O702)","v":2569},{"$f":"IF(M703>O702*2,\"x2\",O702)","v":2569},{"$f":"IF(P703=\"x2\",M703,\"\")","v":""},null,{"$f":"M703*100/M1336","v":3.4618605949685146},{"$f":"IF(J703-J702=0,\"\",J703-J702)","v":12},{"$f":"IF(K703-K702=0,\"\",K703-K702)","v":17},{"$f":"IF(L703-L702=0,\"\",L703-L702)","v":25},{"$f":"IF(M703-M702=0,\"\",M703-M702)","v":123},780,0.80152329749103945,6.4292114695340505E-2,0.13418458781362008,{"$f":"L703*100/B$1285","v":21166.077738515902}]
["2020-04-06T17:00:00",11,"Marche",1001,140,1141,2565,3706,128,150,296,612,4614,15919,{"$f":"IF(P704=\"x2\",M704,O703)","v":2569},{"$f":"IF(M704>O703*2,\"x2\",O703)","v":2569},{"$f":"IF(P704=\"x2\",M704,\"\")","v":""},null,{"$f":"M704*100/M1337","v":3.4810293707137845},{"$f":"IF(J704-J703=0,\"\",J704-J703)","v":27},{"$f":"IF(K704-K703=0,\"\",K704-K703)","v":9},{"$f":"IF(L704-L703=0,\"\",L704-L703)","v":13},{"$f":"IF(M704-M703=0,\"\",M704-M703)","v":150},667,0.80320762895535325,6.4152579107065455E-2,0.13263979193758127,{"$f":"L704*100/B$1285","v":21625.441696113074}]
["2020-04-07T17:00:00",11,"Marche",962,139,1101,2637,3738,32,96,342,630,4710,16619,{"$f":"IF(P705=\"x2\",M705,O704)","v":2569},{"$f":"IF(M705>O704*2,\"x2\",O704)","v":2569},{"$f":"IF(P705=\"x2\",M705,\"\")","v":""},null,{"$f":"M705*100/M1338","v":3.4738099803814553},{"$f":"IF(J705-J704=0,\"\",J705-J704)","v":-54},{"$f":"IF(K705-K704=0,\"\",K705-K704)","v":46},{"$f":"IF(L705-L704=0,\"\",L705-L704)","v":18},{"$f":"IF(M705-M704=0,\"\",M705-M704)","v":96},{"$f":"IF(N705-N704=0,\"\",N705-N704)","v":700},{"$f":"IF(M705=0,0,H705/M705)","v":0.79363057324840769},{"$f":"IF(M705=0,0,K705/M705)","v":7.2611464968152864E-2},{"$f":"IF(M705=0,0,L705/M705)","v":0.13375796178343949},{"$f":"L705*100/B$1285","v":22261.484098939927}]
["2020-04-08T17:00:00",11,"Marche",974,133,1107,2455,3562,-176,149,645,652,4859,17532,{"$f":"IF(P706=\"x2\",M706,O705)","v":2569},{"$f":"IF(M706>O705*2,\"x2\",O705)","v":2569},{"$f":"IF(P706=\"x2\",M706,\"\")","v":""},null,{"$f":"M706*100/M1339","v":3.4851027814835533},{"$f":"IF(J706-J705=0,\"\",J706-J705)","v":53},{"$f":"IF(K706-K705=0,\"\",K706-K705)","v":303},{"$f":"IF(L706-L705=0,\"\",L706-L705)","v":22},{"$f":"IF(M706-M705=0,\"\",M706-M705)","v":149},{"$f":"IF(N706-N705=0,\"\",N706-N705)","v":913},{"$f":"IF(M706=0,0,H706/M706)","v":0.7330726486931467},{"$f":"IF(M706=0,0,K706/M706)","v":0.13274336283185842},{"$f":"IF(M706=0,0,L706/M706)","v":0.13418398847499485},{"$f":"L706*100/B$1285","v":23038.86925795053}]
["2020-04-09T17:00:00",11,"Marche",945,133,1078,2323,3401,-161,96,885,669,4955,18194,{"$f":"IF(P707=\"x2\",M707,O706)","v":2569},{"$f":"IF(M707>O706*2,\"x2\",O706)","v":2569},{"$f":"IF(P707=\"x2\",M707,\"\")","v":""},null,{"$f":"M707*100/M1340","v":3.4499324634815425},{"$f":"IF(J707-J706=0,\"\",J707-J706)","v":-53},{"$f":"IF(K707-K706=0,\"\",K707-K706)","v":240},{"$f":"IF(L707-L706=0,\"\",L707-L706)","v":17},{"$f":"IF(M707-M706=0,\"\",M707-M706)","v":96},{"$f":"IF(N707-N706=0,\"\",N707-N706)","v":662},{"$f":"IF(M707=0,0,H707/M707)","v":0.68637739656912211},{"$f":"IF(M707=0,0,K707/M707)","v":0.17860746720484358},{"$f":"IF(M707=0,0,L707/M707)","v":0.13501513622603431},{"$f":"L707*100/B$1285","v":23639.575971731447}]
["2020-04-10T17:00:00",11,"Marche",925,127,1052,2264,3316,-85,129,1086,682,5084,18970,{"$f":"IF(P708=\"x2\",M708,O707)","v":2569},{"$f":"IF(M708>O707*2,\"x2\",O707)","v":2569},{"$f":"IF(P708=\"x2\",M708,\"\")","v":""},null,{"$f":"M708*100/M1341","v":3.4449812640181059},{"$f":"IF(J708-J707=0,\"\",J708-J707)","v":33},{"$f":"IF(K708-K707=0,\"\",K708-K707)","v":201},{"$f":"IF(L708-L707=0,\"\",L708-L707)","v":13},{"$f":"IF(M708-M707=0,\"\",M708-M707)","v":129},{"$f":"IF(N708-N707=0,\"\",N708-N707)","v":776},{"$f":"IF(M708=0,0,H708/M708)","v":0.65224232887490163},{"$f":"IF(M708=0,0,K708/M708)","v":0.21361132966168372},{"$f":"IF(M708=0,0,L708/M708)","v":0.13414634146341464},{"$f":"L708*100/B$1285","v":24098.939929328622}]
["2020-04-11T17:00:00",11,"Marche",960,118,1078,2153,3231,-85,127,1291,689,5211,20060,{"$f":"IF(P709=\"x2\",M709,O708)","v":5211},{"$f":"IF(M709>O708*2,\"x2\",O708)","v":"x2"},{"$f":"IF(P709=\"x2\",M709,\"\")","v":5211},null,{"$f":"M709*100/M1342","v":3.4221880725811218},{"$f":"IF(J709-J708=0,\"\",J709-J708)","v":-2},{"$f":"IF(K709-K708=0,\"\",K709-K708)","v":205},{"$f":"IF(L709-L708=0,\"\",L709-L708)","v":7},{"$f":"IF(M709-M708=0,\"\",M709-M708)","v":127},{"$f":"IF(N709-N708=0,\"\",N709-N708)","v":1090},{"$f":"IF(M709=0,0,H709/M709)","v":0.62003454231433508},{"$f":"IF(M709=0,0,K709/M709)","v":0.24774515448090578},{"$f":"IF(M709=0,0,L709/M709)","v":0.13222030320475917},{"$f":"L709*100/B$1285","v":24346.289752650177}]
["2020-04-12T17:00:00",11,"Marche",949,114,1063,2051,3114,-117,92,1489,700,5303,21057,{"$f":"IF(P710=\"x2\",M710,O709)","v":5211},{"$f":"IF(M710>O709*2,\"x2\",O709)","v":5211},{"$f":"IF(P710=\"x2\",M710,\"\")","v":""},null,{"$f":"M710*100/M1343","v":3.3914672908552537},{"$f":"IF(J710-J709=0,\"\",J710-J709)","v":-35},{"$f":"IF(K710-K709=0,\"\",K710-K709)","v":198},{"$f":"IF(L710-L709=0,\"\",L710-L709)","v":11},{"$f":"IF(M710-M709=0,\"\",M710-M709)","v":92},{"$f":"IF(N710-N709=0,\"\",N710-N709)","v":997},{"$f":"IF(M710=0,0,H710/M710)","v":0.58721478408448047},{"$f":"IF(M710=0,0,K710/M710)","v":0.28078446162549503},{"$f":"IF(M710=0,0,L710/M710)","v":0.1320007542900245},{"$f":"L710*100/B$1285","v":24734.982332155476}]
["2020-04-13T17:00:00",11,"Marche",959,108,1067,2013,3080,-34,78,1588,713,5381,28379,{"$f":"IF(P711=\"x2\",M711,O710)","v":5211},{"$f":"IF(M711>O710*2,\"x2\",O710)","v":5211},{"$f":"IF(P711=\"x2\",M711,\"\")","v":""},null,{"$f":"M711*100/M1344","v":3.37332932119662},{"$f":"IF(J711-J710=0,\"\",J711-J710)","v":-14},{"$f":"IF(K711-K710=0,\"\",K711-K710)","v":99},{"$f":"IF(L711-L710=0,\"\",L711-L710)","v":13},{"$f":"IF(M711-M710=0,\"\",M711-M710)","v":78},{"$f":"IF(N711-N710=0,\"\",N711-N710)","v":7322},{"$f":"IF(M711=0,0,H711/M711)","v":0.57238431518305144},{"$f":"IF(M711=0,0,K711/M711)","v":0.29511243263333953},{"$f":"IF(M711=0,0,L711/M711)","v":0.132503252183609},{"$f":"L711*100/B$1285","v":25194.346289752648}]
["2020-04-14T17:00:00",11,"Marche",937,106,1043,2052,3095,15,45,1603,728,5426,29160,{"$f":"IF(P712=\"x2\",M712,O711)","v":5211},{"$f":"IF(M712>O711*2,\"x2\",O711)","v":5211},{"$f":"IF(P712=\"x2\",M712,\"\")","v":""},null,{"$f":"M712*100/M1345","v":3.3393235192752697},{"$f":"IF(J712-J711=0,\"\",J712-J711)","v":-33},{"$f":"IF(K712-K711=0,\"\",K712-K711)","v":15},{"$f":"IF(L712-L711=0,\"\",L712-L711)","v":15},{"$f":"IF(M712-M711=0,\"\",M712-M711)","v":45},{"$f":"IF(N712-N711=0,\"\",N712-N711)","v":781},{"$f":"IF(M712=0,0,H712/M712)","v":0.57040176925912278},{"$f":"IF(M712=0,0,K712/M712)","v":0.29542941393291561},{"$f":"IF(M712=0,0,L712/M712)","v":0.13416881680796167},{"$f":"L712*100/B$1285","v":25724.381625441696}]
["2020-04-15T17:00:00",11,"Marche",888,106,994,2103,3097,2,77,1660,746,5503,30329,{"$f":"IF(P713=\"x2\",M713,O712)","v":5211},{"$f":"IF(M713>O712*2,\"x2\",O712)","v":5211},{"$f":"IF(P713=\"x2\",M713,\"\")","v":""},null,{"$f":"M713*100/M1346","v":3.3320214344100996},{"$f":"IF(J713-J712=0,\"\",J713-J712)","v":32},{"$f":"IF(K713-K712=0,\"\",K713-K712)","v":57},{"$f":"IF(L713-L712=0,\"\",L713-L712)","v":18},{"$f":"IF(M713-M712=0,\"\",M713-M712)","v":77},{"$f":"IF(N713-N712=0,\"\",N713-N712)","v":1169},{"$f":"IF(M713=0,0,H713/M713)","v":0.56278393603489008},{"$f":"IF(M713=0,0,K713/M713)","v":0.30165364346719969},{"$f":"IF(M713=0,0,L713/M713)","v":0.13556242049791023},{"$f":"L713*100/B$1285","v":26360.42402826855}]
[{"$f":"A713 + 1","v":"2020-04-16T17:00:00"},null,null,null,null,null,null,null,null,null,null,null,null,null,null,"Media x2",{"$f":"COUNT(M662:M713) / COUNT(Q662:Q713)","v":4.333333333333333}]
[{"$f":"A714+1","v":"2020-04-17T17:00:00"}]
[{"$f":"A715+1","v":"2020-04-18T17:00:00"}]
[null,null,null,null,{"$f":"E713/$M713","v":1.9262220606941667E-2},null,null,{"$f":"H713/$M713","v":0.56278393603489008},null,null,{"$f":"K713/$M713","v":0.30165364346719969},{"$f":"L713/$M713","v":0.13556242049791023},null,{"$f":"N713/$M713","v":5.5113574413956021}]
[]
[]
[]
["Data","Codice","Regione","Ricoverati","Terap. Intens.","Ospedalizzati","Quarantena","Positivi","+ Positivi","Nuovi","Guariti","Deceduti","Totale","Tamponi",null,null,"x 2",null,"% su Tot.","+ Nuovi","+ Guariti","+ Deceduti","+ Totali","+ Tamponi","% Positivi","% Guariti","% Deceduti","P. Stimati"]
["2020-02-24T18:00:00",12,"Lazio",1,1,2,0,2,0,2,1,0,3,124,{"$f":"M722","v":3},null,{"$f":"M722","v":3},null,{"$f":"M722*100/M1295","v":1.3100436681222707},null,null,null,null,null,{"$f":"IF(M722=0,0,H722/M722)","v":0.66666666666666663},{"$f":"IF(M722=0,0,K722/M722)","v":0.33333333333333331},{"$f":"IF(M722=0,0,L722/M722)","v":0},{"$f":"L722*100/B$1285","v":0}]
["2020-02-25T18:00:00",12,"Lazio",1,1,2,0,2,0,0,1,0,3,124,{"$f":"IF(P723=\"x2\",M723,O722)","v":3},{"$f":"IF(M723>O722*2,\"x2\",O722)","v":3},{"$f":"IF(P723=\"x2\",M723,\"\")","v":""},null,{"$f":"M723*100/M1296","v":0.93167701863354035},{"$f":"IF(J723-J722=0,\"\",J723-J722)","v":-2},{"$f":"IF(K723-K722=0,\"\",K723-K722)","v":""},{"$f":"IF(L723-L722=0,\"\",L723-L722)","v":""},{"$f":"IF(M723-M722=0,\"\",M723-M722)","v":""},{"$f":"IF(N723-N722=0,\"\",N723-N722)","v":""},0.66666666666666663,0.33333333333333331,0,{"$f":"L723*100/B$1285","v":0}]
["2020-02-26T18:00:00",12,"Lazio",0,0,0,0,0,-2,-2,3,0,3,124,3,3,"",null,{"$f":"M724*100/M1297","v":0.75},-2,2,"","","",0,1,0,{"$f":"L724*100/B$1285","v":0}]
["2020-02-27T18:00:00",12,"Lazio",0,0,0,0,0,0,0,3,0,3,552,3,3,"",null,{"$f":"M725*100/M1298","v":0.46153846153846156},2,"","","",428,0,1,0,{"$f":"L725*100/B$1285","v":0}]
["2020-02-28T18:00:00",12,"Lazio",0,0,0,0,0,0,0,3,0,3,611,3,3,"",null,{"$f":"M726*100/M1299","v":0.33783783783783783},"","","","",59,0,1,0,{"$f":"L726*100/B$1285","v":0}]
["2020-02-29T17:00:00",12,"Lazio",3,0,3,0,3,3,3,3,0,6,679,3,3,"",null,{"$f":"M727*100/M1300","v":0.53191489361702127},3,"","",3,68,0.5,0.5,0,{"$f":"L727*100/B$1285","v":0}]
["2020-03-01T17:00:00",12,"Lazio",3,0,3,0,3,0,0,3,0,6,724,3,3,"",null,{"$f":"M728*100/M1301","v":0.35419126328217237},-3,"","","",45,0.5,0.5,0,{"$f":"L728*100/B$1285","v":0}]
["2020-03-02T18:00:00",12,"Lazio",3,0,3,1,4,1,1,3,0,7,773,7,"x2",7,null,{"$f":"M729*100/M1302","v":0.34381139489194501},1,"","",1,49,0.5714285714285714,0.42857142857142855,0,{"$f":"L729*100/B$1285","v":0}]
["2020-03-03T18:00:00",12,"Lazio",10,0,10,1,11,7,7,3,0,14,877,7,7,"",null,{"$f":"M730*100/M1303","v":0.55955235811350923},6,"","",7,104,0.7857142857142857,0.21428571428571427,0,{"$f":"L730*100/B$1285","v":0}]
["2020-03-04T17:00:00",12,"Lazio",15,3,18,9,27,16,16,3,0,30,995,30,"x2",30,null,{"$f":"M731*100/M1304","v":0.9711880867594691},9,"","",16,118,0.9,0.1,0,{"$f":"L731*100/B$1285","v":0}]
["2020-03-05T17:00:00",12,"Lazio",20,7,27,14,41,14,14,3,0,44,1175,30,30,"",null,{"$f":"M732*100/M1305","v":1.1404872991187143},-2,"","",14,180,0.93181818181818177,6.8181818181818177E-2,0,{"$f":"L732*100/B$1285","v":0}]
["2020-03-06T17:00:00",12,"Lazio",26,8,34,16,50,9,9,3,1,54,1373,30,30,"",null,{"$f":"M733*100/M1306","v":1.1647972389991372},-5,"",1,10,198,0.92592592592592593,5.5555555555555552E-2,1.8518518518518517E-2,{"$f":"L733*100/B$1285","v":35.335689045936398}]
["2020-03-07T18:00:00",12,"Lazio",43,8,51,21,72,22,22,3,1,76,1582,76,"x2",76,null,{"$f":"M734*100/M1307","v":1.2918578956314806},13,"","",22,209,0.94736842105263153,3.9473684210526314E-2,1.3157894736842105E-2,{"$f":"L734*100/B$1285","v":35.335689045936398}]
["2020-03-08T18:00:00",12,"Lazio",47,8,55,26,81,9,9,3,3,87,1929,76,76,"",null,{"$f":"M735*100/M1308","v":1.1796610169491526},-13,"",2,11,347,0.93103448275862066,3.4482758620689655E-2,3.4482758620689655E-2,{"$f":"L735*100/B$1285","v":106.00706713780919}]
["2020-03-09T18:00:00",12,"Lazio",55,8,63,31,94,13,13,3,5,102,1929,76,76,"",null,{"$f":"M736*100/M1309","v":1.1120802442215438},4,"",2,15,"",0.92156862745098034,2.9411764705882353E-2,4.9019607843137254E-2,{"$f":"L736*100/B$1285","v":176.67844522968198}]
["2020-03-10T18:00:00",12,"Lazio",50,15,65,34,99,5,5,11,6,116,3591,76,76,"",null,{"$f":"M737*100/M1310","v":1.1429697507143561},-8,8,1,14,1662,0.85344827586206895,9.4827586206896547E-2,5.1724137931034482E-2,{"$f":"L737*100/B$1285","v":212.01413427561837}]
["2020-03-11T17:00:00",12,"Lazio",67,18,85,40,125,26,26,19,6,150,3591,76,76,"",null,{"$f":"M738*100/M1311","v":1.203659123736158},21,8,"",34,"",0.83333333333333337,0.12666666666666668,0.04,{"$f":"L738*100/B$1285","v":212.01413427561837}]
["2020-03-12T17:00:00",12,"Lazio",85,20,105,67,172,47,47,19,9,200,5592,200,"x2",200,null,{"$f":"M739*100/M1312","v":1.3233639912657977},21,"",3,50,2001,0.86,9.5000000000000001E-2,4.4999999999999998E-2,{"$f":"L739*100/B$1285","v":318.02120141342755}]
["2020-03-13T17:00:00",12,"Lazio",122,24,146,96,242,70,70,24,11,277,6491,200,200,"",null,{"$f":"M740*100/M1313","v":1.5685164212910532},23,5,2,77,899,0.87364620938628157,8.6642599277978335E-2,3.9711191335740074E-2,{"$f":"L740*100/B$1285","v":388.69257950530033}]
["2020-03-14T17:00:00",12,"Lazio",181,25,206,114,320,78,78,24,13,357,7335,200,200,"",null,{"$f":"M741*100/M1314","v":1.6873847899040506},8,"",2,80,844,0.89635854341736698,6.7226890756302518E-2,3.6414565826330535E-2,{"$f":"L741*100/B$1285","v":459.36395759717311}]
["2020-03-15T17:00:00",12,"Lazio",223,31,254,142,396,76,76,24,16,436,8345,436,"x2",436,null,{"$f":"M742*100/M1315","v":1.7618297167333414},-2,"",3,79,1010,0.90825688073394495,5.5045871559633031E-2,3.669724770642202E-2,{"$f":"L742*100/B$1285","v":565.37102473498237}]
["2020-03-16T17:00:00",12,"Lazio",267,31,298,174,472,76,76,32,19,523,9330,436,436,"",null,{"$f":"M743*100/M1316","v":1.8691922802001431},"",8,3,87,985,0.90248565965583172,6.1185468451242828E-2,3.6328871892925434E-2,{"$f":"L743*100/B$1285","v":671.37809187279152}]
["2020-03-17T17:00:00",12,"Lazio",314,44,358,192,550,78,78,34,23,607,9436,436,436,"",null,{"$f":"M744*100/M1317","v":1.926617152288453},2,2,4,84,106,0.90609555189456348,5.6013179571663921E-2,3.789126853377265E-2,{"$f":"L744*100/B$1285","v":812.72084805653708}]
["2020-03-18T17:00:00",12,"Lazio",374,44,418,232,650,100,100,42,32,724,11145,436,436,"",null,{"$f":"M745*100/M1318","v":2.0272729818273456},22,8,9,117,1709,0.89779005524861877,5.8011049723756904E-2,4.4198895027624308E-2,{"$f":"L745*100/B$1285","v":1130.7420494699647}]
["2020-03-19T17:00:00",12,"Lazio",426,45,471,270,741,91,91,44,38,823,11145,436,436,"",null,{"$f":"M746*100/M1319","v":2.0056049713659072},-9,2,6,99,"",0.90036452004860268,5.3462940461725394E-2,4.6172539489671933E-2,{"$f":"L746*100/B$1285","v":1342.756183745583}]
["2020-03-20T17:00:00",12,"Lazio",537,47,584,328,912,171,171,53,43,1008,13889,1008,"x2",1008,null,{"$f":"M747*100/M1320","v":2.1437230173752155},80,9,5,185,{"$f":"IF(N747-N746=0,\"\",N747-N746)","v":2744},0.90476190476190477,5.257936507936508E-2,4.265873015873016E-2,{"$f":"L747*100/B$1285","v":1519.434628975265}]
["2020-03-21T17:00:00",12,"Lazio",591,70,661,425,1086,174,174,54,50,1190,13889,1008,1008,"",null,{"$f":"M748*100/M1321","v":2.2210608831983278},3,1,7,{"$f":"IF(M748-M747=0,\"\",M748-M747)","v":182},"",0.9126050420168067,4.53781512605042E-2,4.2016806722689079E-2,{"$f":"L748*100/B$1285","v":1766.7844522968198}]
["2020-03-22T17:00:00",12,"Lazio",671,79,750,522,1272,186,186,58,53,1383,17845,1008,1008,"",null,{"$f":"M749*100/M1322","v":2.3385978558625586},12,4,3,193,3956,0.91973969631236441,4.1937816341287057E-2,3.8322487346348515E-2,{"$f":"L749*100/B$1285","v":1872.791519434629}]
["2020-03-23T17:00:00",12,"Lazio",718,96,814,600,1414,142,142,63,63,1540,18371,1008,1008,"",null,{"$f":"M750*100/M1323","v":2.4089977630735055},-44,5,10,157,526,0.91818181818181821,4.0909090909090909E-2,4.0909090909090909E-2,{"$f":"L750*100/B$1285","v":2226.1484098939927}]
["2020-03-24T17:00:00",12,"Lazio",747,94,841,704,1545,131,131,103,80,1728,18371,1008,1008,"",null,{"$f":"M751*100/M1324","v":2.497976176708685},-11,40,17,188,"",0.89409722222222221,5.9606481481481483E-2,4.6296296296296294E-2,{"$f":"L751*100/B$1285","v":2826.8551236749117}]
["2020-03-25T17:00:00",12,"Lazio",805,101,906,769,1675,130,130,131,95,1901,20669,1008,1008,"",null,{"$f":"M752*100/M1325","v":2.555588417175275},-1,28,15,173,2298,0.88111520252498687,6.8911099421357175E-2,4.9973698053655972E-2,{"$f":"L752*100/B$1285","v":3356.8904593639577}]
["2020-03-26T17:00:00",12,"Lazio",878,113,991,844,1835,160,160,155,106,2096,22771,2096,"x2",2096,null,{"$f":"M753*100/M1326","v":2.6024658860924519},30,24,11,195,{"$f":"IF(N753-N752=0,\"\",N753-N752)","v":2102},0.87547709923664119,7.3950381679389318E-2,5.0572519083969467E-2,{"$f":"L753*100/B$1285","v":3745.583038869258}]
["2020-03-27T17:00:00",12,"Lazio",992,126,1118,895,2013,178,199,164,118,2295,24106,{"$f":"IF(P754=\"x2\",M754,O753)","v":2096},{"$f":"IF(M754>O753*2,\"x2\",O753)","v":2096},{"$f":"IF(P754=\"x2\",M754,\"\")","v":""},null,{"$f":"M754*100/M1327","v":2.6532405373534647},{"$f":"IF(J754-J753=0,\"\",J754-J753)","v":39},9,12,199,1335,0.87712418300653594,7.1459694989106759E-2,5.1416122004357301E-2,{"$f":"L754*100/B$1285","v":4169.611307420495}]
["2020-03-28T17:00:00",12,"Lazio",985,133,1118,1063,2181,168,210,200,124,2505,27179,2096,2096,"",null,{"$f":"M755*100/M1328","v":2.7089281079678171},11,36,6,210,3073,0.87065868263473056,7.9840319361277445E-2,4.9500998003992019E-2,{"$f":"L755*100/B$1285","v":4381.6254416961128}]
["2020-03-29T17:00:00",12,"Lazio",1062,133,1195,1167,2362,181,201,208,136,2706,27744,2096,2096,"",null,{"$f":"M756*100/M1329","v":2.7700150477535854},-9,8,12,201,565,0.87287509238728755,7.6866223207686629E-2,5.0258684405025872E-2,{"$f":"L756*100/B$1285","v":4805.6537102473494}]
["2020-03-30T17:00:00",12,"Lazio",1079,154,1233,1264,2497,135,208,267,150,2914,32846,2096,2096,"",null,{"$f":"M757*100/M1330","v":2.864191706228683},7,59,14,208,5102,0.8568977350720659,9.1626630061770756E-2,5.1475634866163349E-2,{"$f":"L757*100/B$1285","v":5300.3533568904595}]
["2020-03-31T17:00:00",12,"Lazio",1127,173,1300,1342,2642,145,181,291,162,3095,34677,2096,2096,"",null,{"$f":"M758*100/M1331","v":2.92555202661827},-27,24,12,181,1831,0.85363489499192247,9.4022617124394178E-2,5.2342487883683363E-2,{"$f":"L758*100/B$1285","v":5724.3816254416961}]
["2020-04-01T17:00:00",12,"Lazio",1131,177,1308,1450,2758,116,169,337,169,3264,35810,2096,2096,"",null,{"$f":"M759*100/M1332","v":2.9518693363720225},-12,46,7,169,{"$f":"IF(N759-N758=0,\"\",N759-N758)","v":1133},{"$f":"IF(M759=0,0,H759/M759)","v":0.84497549019607843},{"$f":"IF(M759=0,0,K759/M759)","v":0.10324754901960784},{"$f":"IF(M759=0,0,L759/M759)","v":5.1776960784313729E-2},{"$f":"L759*100/B$1285","v":5971.7314487632511}]
["2020-04-02T17:00:00",12,"Lazio",1169,181,1350,1529,2879,121,169,369,185,3433,41575,{"$f":"IF(P760=\"x2\",M760,O759)","v":2096},{"$f":"IF(M760>O759*2,\"x2\",O759)","v":2096},{"$f":"IF(P760=\"x2\",M760,\"\")","v":""},null,{"$f":"M760*100/M1333","v":2.9789486471945992},{"$f":"IF(J760-J759=0,\"\",J760-J759)","v":""},{"$f":"IF(K760-K759=0,\"\",K760-K759)","v":32},{"$f":"IF(L760-L759=0,\"\",L760-L759)","v":16},{"$f":"IF(M760-M759=0,\"\",M760-M759)","v":169},5765,0.83862510923390621,0.10748616370521411,5.3888727060879694E-2,{"$f":"L760*100/B$1285","v":6537.1024734982329}]
["2020-04-03T17:00:00",12,"Lazio",1194,188,1382,1627,3009,130,167,392,199,3600,43776,{"$f":"IF(P761=\"x2\",M761,O760)","v":2096},{"$f":"IF(M761>O760*2,\"x2\",O760)","v":2096},{"$f":"IF(P761=\"x2\",M761,\"\")","v":""},null,{"$f":"M761*100/M1334","v":3.0043312442104035},{"$f":"IF(J761-J760=0,\"\",J761-J760)","v":-2},{"$f":"IF(K761-K760=0,\"\",K761-K760)","v":23},{"$f":"IF(L761-L760=0,\"\",L761-L760)","v":14},{"$f":"IF(M761-M760=0,\"\",M761-M760)","v":167},2201,0.83583333333333332,0.10888888888888888,5.527777777777778E-2,{"$f":"L761*100/B$1285","v":7031.8021201413421}]
["2020-04-04T17:00:00",12,"Lazio",1236,193,1429,1677,3106,97,157,439,212,3757,44624,{"$f":"IF(P762=\"x2\",M762,O761)","v":2096},{"$f":"IF(M762>O761*2,\"x2\",O761)","v":2096},{"$f":"IF(P762=\"x2\",M762,\"\")","v":""},null,{"$f":"M762*100/M1335","v":3.0144746132614415},{"$f":"IF(J762-J761=0,\"\",J762-J761)","v":-10},{"$f":"IF(K762-K761=0,\"\",K762-K761)","v":47},{"$f":"IF(L762-L761=0,\"\",L762-L761)","v":13},{"$f":"IF(M762-M761=0,\"\",M762-M761)","v":157},848,0.82672344956081978,0.11684854937450093,5.6428001064679267E-2,{"$f":"L762*100/B$1285","v":7491.1660777385159}]
["2020-04-05T17:00:00",12,"Lazio",1235,197,1432,1754,3186,80,123,475,219,3880,44658,{"$f":"IF(P763=\"x2\",M763,O762)","v":2096},{"$f":"IF(M763>O762*2,\"x2\",O762)","v":2096},{"$f":"IF(P763=\"x2\",M763,\"\")","v":""},null,{"$f":"M763*100/M1336","v":3.0089648540496943},{"$f":"IF(J763-J762=0,\"\",J763-J762)","v":-34},{"$f":"IF(K763-K762=0,\"\",K763-K762)","v":36},{"$f":"IF(L763-L762=0,\"\",L763-L762)","v":7},{"$f":"IF(M763-M762=0,\"\",M763-M762)","v":123},34,0.82113402061855667,0.12242268041237113,5.6443298969072166E-2,{"$f":"L763*100/B$1285","v":7738.5159010600701}]
["2020-04-06T17:00:00",12,"Lazio",1235,197,1432,1868,3300,114,151,502,229,4031,47470,{"$f":"IF(P764=\"x2\",M764,O763)","v":2096},{"$f":"IF(M764>O763*2,\"x2\",O763)","v":2096},{"$f":"IF(P764=\"x2\",M764,\"\")","v":""},null,{"$f":"M764*100/M1337","v":3.0411853908424935},{"$f":"IF(J764-J763=0,\"\",J764-J763)","v":28},{"$f":"IF(K764-K763=0,\"\",K764-K763)","v":27},{"$f":"IF(L764-L763=0,\"\",L764-L763)","v":10},{"$f":"IF(M764-M763=0,\"\",M764-M763)","v":151},2812,0.81865542049119322,0.12453485487472091,5.6809724634085831E-2,{"$f":"L764*100/B$1285","v":8091.872791519434}]
["2020-04-07T17:00:00",12,"Lazio",1229,192,1421,1944,3365,65,118,546,238,4149,48874,{"$f":"IF(P765=\"x2\",M765,O764)","v":2096},{"$f":"IF(M765>O764*2,\"x2\",O764)","v":2096},{"$f":"IF(P765=\"x2\",M765,\"\")","v":""},null,{"$f":"M765*100/M1338","v":3.0600504476863395},{"$f":"IF(J765-J764=0,\"\",J765-J764)","v":-33},{"$f":"IF(K765-K764=0,\"\",K765-K764)","v":44},{"$f":"IF(L765-L764=0,\"\",L765-L764)","v":9},{"$f":"IF(M765-M764=0,\"\",M765-M764)","v":118},{"$f":"IF(N765-N764=0,\"\",N765-N764)","v":1404},{"$f":"IF(M765=0,0,H765/M765)","v":0.81103880453121235},{"$f":"IF(M765=0,0,K765/M765)","v":0.13159797541576285},{"$f":"IF(M765=0,0,L765/M765)","v":5.7363220053024827E-2},{"$f":"L765*100/B$1285","v":8409.8939929328626}]
["2020-04-08T17:00:00",12,"Lazio",1241,196,1437,2011,3448,83,117,574,244,4266,55113,{"$f":"IF(P766=\"x2\",M766,O765)","v":4266},{"$f":"IF(M766>O765*2,\"x2\",O765)","v":"x2"},{"$f":"IF(P766=\"x2\",M766,\"\")","v":4266},null,{"$f":"M766*100/M1339","v":3.0597753582648362},{"$f":"IF(J766-J765=0,\"\",J766-J765)","v":-1},{"$f":"IF(K766-K765=0,\"\",K766-K765)","v":28},{"$f":"IF(L766-L765=0,\"\",L766-L765)","v":6},{"$f":"IF(M766-M765=0,\"\",M766-M765)","v":117},{"$f":"IF(N766-N765=0,\"\",N766-N765)","v":6239},{"$f":"IF(M766=0,0,H766/M766)","v":0.80825128926394751},{"$f":"IF(M766=0,0,K766/M766)","v":0.13455227379278012},{"$f":"IF(M766=0,0,L766/M766)","v":5.7196436943272387E-2},{"$f":"L766*100/B$1285","v":8621.9081272084804}]
["2020-04-09T17:00:00",12,"Lazio",1244,198,1442,2090,3532,84,163,644,253,4429,58107,{"$f":"IF(P767=\"x2\",M767,O766)","v":4266},{"$f":"IF(M767>O766*2,\"x2\",O766)","v":4266},{"$f":"IF(P767=\"x2\",M767,\"\")","v":""},null,{"$f":"M767*100/M1340","v":3.083703507721443},{"$f":"IF(J767-J766=0,\"\",J767-J766)","v":46},{"$f":"IF(K767-K766=0,\"\",K767-K766)","v":70},{"$f":"IF(L767-L766=0,\"\",L767-L766)","v":9},{"$f":"IF(M767-M766=0,\"\",M767-M766)","v":163},{"$f":"IF(N767-N766=0,\"\",N767-N766)","v":2994},{"$f":"IF(M767=0,0,H767/M767)","v":0.79747121246330999},{"$f":"IF(M767=0,0,K767/M767)","v":0.14540528335967487},{"$f":"IF(M767=0,0,L767/M767)","v":5.712350417701513E-2},{"$f":"L767*100/B$1285","v":8939.9293286219072}]
["2020-04-10T17:00:00",12,"Lazio",1236,201,1437,2196,3633,101,154,687,263,4583,61769,{"$f":"IF(P768=\"x2\",M768,O767)","v":4266},{"$f":"IF(M768>O767*2,\"x2\",O767)","v":4266},{"$f":"IF(P768=\"x2\",M768,\"\")","v":""},null,{"$f":"M768*100/M1341","v":3.1054974691178163},{"$f":"IF(J768-J767=0,\"\",J768-J767)","v":-9},{"$f":"IF(K768-K767=0,\"\",K768-K767)","v":43},{"$f":"IF(L768-L767=0,\"\",L768-L767)","v":10},{"$f":"IF(M768-M767=0,\"\",M768-M767)","v":154},{"$f":"IF(N768-N767=0,\"\",N768-N767)","v":3662},{"$f":"IF(M768=0,0,H768/M768)","v":0.79271219725070918},{"$f":"IF(M768=0,0,K768/M768)","v":0.14990181104080297},{"$f":"IF(M768=0,0,L768/M768)","v":5.7385991708487891E-2},{"$f":"L768*100/B$1285","v":9293.2862190812721}]
["2020-04-11T17:00:00",12,"Lazio",1264,203,1467,2263,3730,97,140,720,273,4723,65241,{"$f":"IF(P769=\"x2\",M769,O768)","v":4266},{"$f":"IF(M769>O768*2,\"x2\",O768)","v":4266},{"$f":"IF(P769=\"x2\",M769,\"\")","v":""},null,{"$f":"M769*100/M1342","v":3.1017068253311528},{"$f":"IF(J769-J768=0,\"\",J769-J768)","v":-14},{"$f":"IF(K769-K768=0,\"\",K769-K768)","v":33},{"$f":"IF(L769-L768=0,\"\",L769-L768)","v":10},{"$f":"IF(M769-M768=0,\"\",M769-M768)","v":140},{"$f":"IF(N769-N768=0,\"\",N769-N768)","v":3472},{"$f":"IF(M769=0,0,H769/M769)","v":0.78975227609570187},{"$f":"IF(M769=0,0,K769/M769)","v":0.15244547956807114},{"$f":"IF(M769=0,0,L769/M769)","v":5.7802244336226972E-2},{"$f":"L769*100/B$1285","v":9646.6431095406351}]
["2020-04-12T17:00:00",12,"Lazio",1268,201,1469,2348,3817,87,122,749,279,4845,68954,{"$f":"IF(P770=\"x2\",M770,O769)","v":4266},{"$f":"IF(M770>O769*2,\"x2\",O769)","v":4266},{"$f":"IF(P770=\"x2\",M770,\"\")","v":""},null,{"$f":"M770*100/M1343","v":3.0985591220429387},{"$f":"IF(J770-J769=0,\"\",J770-J769)","v":-18},{"$f":"IF(K770-K769=0,\"\",K770-K769)","v":29},{"$f":"IF(L770-L769=0,\"\",L770-L769)","v":6},{"$f":"IF(M770-M769=0,\"\",M770-M769)","v":122},{"$f":"IF(N770-N769=0,\"\",N770-N769)","v":3713},{"$f":"IF(M770=0,0,H770/M770)","v":0.78782249742002064},{"$f":"IF(M770=0,0,K770/M770)","v":0.15459236326109391},{"$f":"IF(M770=0,0,L770/M770)","v":5.7585139318885446E-2},{"$f":"L770*100/B$1285","v":9858.6572438162548}]
["2020-04-13T17:00:00",12,"Lazio",1314,200,1514,2406,3920,103,123,764,284,4968,72746,{"$f":"IF(P771=\"x2\",M771,O770)","v":4266},{"$f":"IF(M771>O770*2,\"x2\",O770)","v":4266},{"$f":"IF(P771=\"x2\",M771,\"\")","v":""},null,{"$f":"M771*100/M1344","v":3.1144211238997968},{"$f":"IF(J771-J770=0,\"\",J771-J770)","v":1},{"$f":"IF(K771-K770=0,\"\",K771-K770)","v":15},{"$f":"IF(L771-L770=0,\"\",L771-L770)","v":5},{"$f":"IF(M771-M770=0,\"\",M771-M770)","v":123},{"$f":"IF(N771-N770=0,\"\",N771-N770)","v":3792},{"$f":"IF(M771=0,0,H771/M771)","v":0.78904991948470204},{"$f":"IF(M771=0,0,K771/M771)","v":0.1537842190016103},{"$f":"IF(M771=0,0,L771/M771)","v":5.7165861513687598E-2},{"$f":"L771*100/B$1285","v":10035.335689045936}]
["2020-04-14T17:00:00",12,"Lazio",1344,199,1543,2479,4022,102,143,789,300,5111,74650,{"$f":"IF(P772=\"x2\",M772,O771)","v":4266},{"$f":"IF(M772>O771*2,\"x2\",O771)","v":4266},{"$f":"IF(P772=\"x2\",M772,\"\")","v":""},null,{"$f":"M772*100/M1345","v":3.1454630495790457},{"$f":"IF(J772-J771=0,\"\",J772-J771)","v":20},{"$f":"IF(K772-K771=0,\"\",K772-K771)","v":25},{"$f":"IF(L772-L771=0,\"\",L772-L771)","v":16},{"$f":"IF(M772-M771=0,\"\",M772-M771)","v":143},{"$f":"IF(N772-N771=0,\"\",N772-N771)","v":1904},{"$f":"IF(M772=0,0,H772/M772)","v":0.78693015065544902},{"$f":"IF(M772=0,0,K772/M772)","v":0.15437292115045978},{"$f":"IF(M772=0,0,L772/M772)","v":5.8696928194091176E-2},{"$f":"L772*100/B$1285","v":10600.706713780919}]
["2020-04-15T17:00:00",12,"Lazio",1342,196,1538,2509,4047,25,121,874,311,5232,75584,{"$f":"IF(P773=\"x2\",M773,O772)","v":4266},{"$f":"IF(M773>O772*2,\"x2\",O772)","v":4266},{"$f":"IF(P773=\"x2\",M773,\"\")","v":""},null,{"$f":"M773*100/M1346","v":3.1679331537040962},{"$f":"IF(J773-J772=0,\"\",J773-J772)","v":-22},{"$f":"IF(K773-K772=0,\"\",K773-K772)","v":85},{"$f":"IF(L773-L772=0,\"\",L773-L772)","v":11},{"$f":"IF(M773-M772=0,\"\",M773-M772)","v":121},{"$f":"IF(N773-N772=0,\"\",N773-N772)","v":934},{"$f":"IF(M773=0,0,H773/M773)","v":0.77350917431192656},{"$f":"IF(M773=0,0,K773/M773)","v":0.16704892966360857},{"$f":"IF(M773=0,0,L773/M773)","v":5.9441896024464834E-2},{"$f":"L773*100/B$1285","v":10989.399293286218}]
[{"$f":"A773 + 1","v":"2020-04-16T17:00:00"},null,null,null,null,null,null,null,null,null,null,null,null,null,null,"Media x2",{"$f":"COUNT(M722:M773) / COUNT(Q722:Q773)","v":5.7777777777777777}]
[{"$f":"A774+1","v":"2020-04-17T17:00:00"}]
[{"$f":"A775+1","v":"2020-04-18T17:00:00"}]
[null,null,null,null,{"$f":"E773/$M773","v":3.746177370030581E-2},null,null,{"$f":"H773/$M773","v":0.77350917431192656},null,null,{"$f":"K773/$M773","v":0.16704892966360857},{"$f":"L773/$M773","v":5.9441896024464834E-2},null,{"$f":"N773/$M773","v":14.446483180428135}]
[]
[]
[]
["Data","Codice","Regione","Ricoverati","Terap. Intens.","Ospedalizzati","Quarantena","Positivi","+ Positivi","Nuovi","Guariti","Deceduti","Totale","Tamponi",null,null,"x 2",null,"% su Tot.","+ Nuovi","+ Guariti","+ Deceduti","+ Totali","+ Tamponi","% Positivi","% Guariti","% Deceduti","P. Stimati"]
["2020-02-24T18:00:00",13,"Abruzzo",0,0,0,0,0,0,0,0,0,0,5,{"$f":"M782","v":0},null,{"$f":"M782","v":0},null,{"$f":"M782*100/M1295","v":0},null,null,null,null,null,{"$f":"IF(M782=0,0,H782/M782)","v":0},{"$f":"IF(M782=0,0,K782/M782)","v":0},{"$f":"IF(M782=0,0,L782/M782)","v":0},{"$f":"L782*100/B$1285","v":0}]
["2020-02-25T18:00:00",13,"Abruzzo",0,0,0,0,0,0,0,0,0,0,5,{"$f":"IF(P783=\"x2\",M783,O782)","v":0},{"$f":"IF(M783>O782*2,\"x2\",O782)","v":0},{"$f":"IF(P783=\"x2\",M783,\"\")","v":""},null,{"$f":"M783*100/M1296","v":0},{"$f":"IF(J783-J782=0,\"\",J783-J782)","v":""},{"$f":"IF(K783-K782=0,\"\",K783-K782)","v":""},{"$f":"IF(L783-L782=0,\"\",L783-L782)","v":""},{"$f":"IF(M783-M782=0,\"\",M783-M782)","v":""},{"$f":"IF(N783-N782=0,\"\",N783-N782)","v":""},0,0,0,{"$f":"L783*100/B$1285","v":0}]
["2020-02-26T18:00:00",13,"Abruzzo",0,0,0,0,0,0,0,0,0,0,13,0,0,"",null,{"$f":"M784*100/M1297","v":0},"","","","",8,0,0,0,{"$f":"L784*100/B$1285","v":0}]
["2020-02-27T18:00:00",13,"Abruzzo",1,0,1,0,1,1,1,0,0,1,33,1,"x2",1,null,{"$f":"M785*100/M1298","v":0.15384615384615385},1,"","",1,20,1,0,0,{"$f":"L785*100/B$1285","v":0}]
["2020-02-28T18:00:00",13,"Abruzzo",1,0,1,0,1,0,0,0,0,1,33,1,1,"",null,{"$f":"M786*100/M1299","v":0.11261261261261261},-1,"","","","",1,0,0,{"$f":"L786*100/B$1285","v":0}]
["2020-02-29T17:00:00",13,"Abruzzo",2,0,2,0,2,1,1,0,0,2,43,1,1,"",null,{"$f":"M787*100/M1300","v":0.1773049645390071},1,"","",1,10,1,0,0,{"$f":"L787*100/B$1285","v":0}]
["2020-03-01T17:00:00",13,"Abruzzo",3,0,3,2,5,3,3,0,0,5,52,5,"x2",5,null,{"$f":"M788*100/M1301","v":0.29515938606847697},2,"","",3,9,1,0,0,{"$f":"L788*100/B$1285","v":0}]
["2020-03-02T18:00:00",13,"Abruzzo",3,0,3,2,5,0,0,0,0,5,52,5,5,"",null,{"$f":"M789*100/M1302","v":0.24557956777996071},-3,"","","","",1,0,0,{"$f":"L789*100/B$1285","v":0}]
["2020-03-03T18:00:00",13,"Abruzzo",5,0,5,1,6,1,1,0,0,6,52,5,5,"",null,{"$f":"M790*100/M1303","v":0.23980815347721823},1,"","",1,"",1,0,0,{"$f":"L790*100/B$1285","v":0}]
["2020-03-04T17:00:00",13,"Abruzzo",7,0,7,0,7,1,1,0,0,7,85,5,5,"",null,{"$f":"M791*100/M1304","v":0.22661055357720944},"","","",1,33,1,0,0,{"$f":"L791*100/B$1285","v":0}]
["2020-03-05T17:00:00",13,"Abruzzo",8,0,8,0,8,1,1,0,0,8,96,5,5,"",null,{"$f":"M792*100/M1305","v":0.20736132711249353},"","","",1,11,1,0,0,{"$f":"L792*100/B$1285","v":0}]
["2020-03-06T17:00:00",13,"Abruzzo",9,0,9,0,9,1,1,0,0,9,96,5,5,"",null,{"$f":"M793*100/M1306","v":0.19413287316652286},"","","",1,"",1,0,0,{"$f":"L793*100/B$1285","v":0}]
["2020-03-07T18:00:00",13,"Abruzzo",11,0,11,0,11,2,2,0,0,11,123,11,"x2",11,null,{"$f":"M794*100/M1307","v":0.18697943226245112},1,"","",2,27,1,0,0,{"$f":"L794*100/B$1285","v":0}]
["2020-03-08T18:00:00",13,"Abruzzo",14,0,14,3,17,6,6,0,0,17,163,11,11,"",null,{"$f":"M795*100/M1308","v":0.23050847457627119},4,"","",6,40,1,0,0,{"$f":"L795*100/B$1285","v":0}]
["2020-03-09T18:00:00",13,"Abruzzo",25,0,25,5,30,13,13,0,0,30,237,30,"x2",30,null,{"$f":"M796*100/M1309","v":0.32708242477104232},7,"","",13,74,1,0,0,{"$f":"L796*100/B$1285","v":0}]
["2020-03-10T18:00:00",13,"Abruzzo",17,9,26,11,37,7,7,0,1,38,310,30,30,"",null,{"$f":"M797*100/M1310","v":0.37442112523401322},-6,"",1,8,73,0.97368421052631582,0,2.6315789473684209E-2,{"$f":"L797*100/B$1285","v":35.335689045936398}]
["2020-03-11T17:00:00",13,"Abruzzo",17,9,26,11,37,0,0,0,1,38,310,30,30,"",null,{"$f":"M798*100/M1311","v":0.30492697801315999},-7,"","","","",0.97368421052631582,0,2.6315789473684209E-2,{"$f":"L798*100/B$1285","v":35.335689045936398}]
["2020-03-12T17:00:00",13,"Abruzzo",47,12,59,19,78,41,41,4,2,84,867,84,"x2",84,null,{"$f":"M799*100/M1312","v":0.55581287633163501},41,4,1,46,557,0.9285714285714286,4.7619047619047616E-2,2.3809523809523808E-2,{"$f":"L799*100/B$1285","v":70.671378091872796}]
["2020-03-13T17:00:00",13,"Abruzzo",42,14,56,27,83,5,5,4,2,89,958,84,84,"",null,{"$f":"M800*100/M1313","v":0.50396375990939979},-36,"","",5,91,0.93258426966292129,4.49438202247191E-2,2.247191011235955E-2,{"$f":"L800*100/B$1285","v":70.671378091872796}]
["2020-03-14T17:00:00",13,"Abruzzo",51,14,65,41,106,23,23,4,2,112,1232,84,84,"",null,{"$f":"M801*100/M1314","v":0.5293756203620551},18,"","",23,274,0.9464285714285714,3.5714285714285712E-2,1.7857142857142856E-2,{"$f":"L801*100/B$1285","v":70.671378091872796}]
["2020-03-15T17:00:00",13,"Abruzzo",72,28,100,28,128,22,22,6,3,137,1419,84,84,"",null,{"$f":"M802*100/M1315","v":0.55360245686345821},-1,2,1,25,187,0.93430656934306566,4.3795620437956206E-2,2.1897810218978103E-2,{"$f":"L802*100/B$1285","v":106.00706713780919}]
["2020-03-16T17:00:00",13,"Abruzzo",71,37,108,57,165,37,37,7,4,176,1533,176,"x2",176,null,{"$f":"M803*100/M1316","v":0.62902072909220874},15,1,1,39,114,0.9375,3.9772727272727272E-2,2.2727272727272728E-2,{"$f":"L803*100/B$1285","v":141.34275618374559}]
["2020-03-17T17:00:00",13,"Abruzzo",94,32,126,90,216,51,51,7,6,229,1688,176,176,"",null,{"$f":"M804*100/M1317","v":0.72684568018790074},14,"",2,53,155,0.94323144104803491,3.0567685589519649E-2,2.6200873362445413E-2,{"$f":"L804*100/B$1285","v":212.01413427561837}]
["2020-03-18T17:00:00",13,"Abruzzo",99,41,140,109,249,33,33,7,7,263,2054,176,176,"",null,{"$f":"M805*100/M1318","v":0.73642651135440873},-18,"",1,34,366,0.94676806083650189,2.6615969581749048E-2,2.6615969581749048E-2,{"$f":"L805*100/B$1285","v":247.34982332155477}]
["2020-03-19T17:00:00",13,"Abruzzo",181,47,228,138,366,117,117,8,11,385,2409,385,"x2",385,null,{"$f":"M806*100/M1319","v":0.93822346777141463},84,1,4,122,355,0.95064935064935063,2.0779220779220779E-2,2.8571428571428571E-2,{"$f":"L806*100/B$1285","v":388.69257950530033}]
["2020-03-20T17:00:00",13,"Abruzzo",190,48,238,184,422,56,56,10,17,449,2695,385,385,"",null,{"$f":"M807*100/M1320","v":0.95489249484272987},-61,2,6,64,{"$f":"IF(N807-N806=0,\"\",N807-N806)","v":286},0.93986636971046766,2.2271714922048998E-2,3.7861915367483297E-2,{"$f":"L807*100/B$1285","v":600.70671378091868}]
["2020-03-21T17:00:00",13,"Abruzzo",185,44,229,265,494,72,72,13,22,529,3035,385,385,"",null,{"$f":"M808*100/M1321","v":0.9873455522789204},16,3,5,{"$f":"IF(M808-M807=0,\"\",M808-M807)","v":80},340,0.93383742911153123,2.4574669187145556E-2,4.1587901701323253E-2,{"$f":"L808*100/B$1285","v":777.38515901060066}]
["2020-03-22T17:00:00",13,"Abruzzo",218,49,267,272,539,45,45,15,33,587,3375,385,385,"",null,{"$f":"M809*100/M1322","v":0.99259359464303831},-27,2,11,58,340,0.91822827938671214,2.5553662691652469E-2,5.6218057921635436E-2,{"$f":"L809*100/B$1285","v":1166.077738515901}]
["2020-03-23T17:00:00",13,"Abruzzo",228,52,280,325,605,66,66,20,38,663,3674,385,385,"",null,{"$f":"M810*100/M1323","v":1.0371204655309962},21,5,5,76,299,0.91251885369532426,3.0165912518853696E-2,5.7315233785822019E-2,{"$f":"L810*100/B$1285","v":1342.756183745583}]
["2020-03-24T17:00:00",13,"Abruzzo",234,57,291,331,622,17,17,21,46,689,4294,385,385,"",null,{"$f":"M811*100/M1324","v":0.99601017693997917},-49,1,8,26,620,0.90275761973875179,3.0478955007256895E-2,6.6763425253991288E-2,{"$f":"L811*100/B$1285","v":1625.4416961130742}]
["2020-03-25T17:00:00",13,"Abruzzo",248,59,307,431,738,116,116,23,52,813,4982,813,"x2",813,null,{"$f":"M812*100/M1325","v":1.0929475976662275},99,2,6,124,688,0.90774907749077494,2.8290282902829027E-2,6.3960639606396058E-2,{"$f":"L812*100/B$1285","v":1837.4558303886924}]
["2020-03-26T17:00:00",13,"Abruzzo",280,64,344,516,860,122,122,23,63,946,5488,813,813,"",null,{"$f":"M813*100/M1326","v":1.1745862253069941},6,"",11,133,{"$f":"IF(N813-N812=0,\"\",N813-N812)","v":506},0.90909090909090906,2.4312896405919663E-2,6.6596194503171252E-2,{"$f":"L813*100/B$1285","v":2226.1484098939927}]
["2020-03-27T17:00:00",13,"Abruzzo",289,71,360,565,925,65,71,24,68,1017,6109,{"$f":"IF(P814=\"x2\",M814,O813)","v":813},{"$f":"IF(M814>O813*2,\"x2\",O813)","v":813},{"$f":"IF(P814=\"x2\",M814,\"\")","v":""},null,{"$f":"M814*100/M1327","v":1.1757497283174176},{"$f":"IF(J814-J813=0,\"\",J814-J813)","v":-51},1,5,71,621,0.90953785644051133,2.359882005899705E-2,6.6863323500491637E-2,{"$f":"L814*100/B$1285","v":2402.8268551236747}]
["2020-03-28T17:00:00",13,"Abruzzo",311,70,381,646,1027,102,116,30,76,1133,7003,813,813,"",null,{"$f":"M815*100/M1328","v":1.2252357470369408},45,6,8,116,894,0.90644307149161518,2.6478375992939101E-2,6.7078552515445714E-2,{"$f":"L815*100/B$1285","v":2685.5123674911661}]
["2020-03-29T17:00:00",13,"Abruzzo",329,68,397,772,1169,142,160,36,88,1293,7730,813,813,"",null,{"$f":"M816*100/M1329","v":1.323588121487578},44,6,12,160,727,0.90409899458623355,2.7842227378190254E-2,6.8058778035576181E-2,{"$f":"L816*100/B$1285","v":3109.5406360424026}]
["2020-03-30T17:00:00",13,"Abruzzo",322,69,391,778,1169,0,52,74,102,1345,7948,813,813,"",null,{"$f":"M817*100/M1330","v":1.3220102418934725},-108,38,14,52,218,0.86914498141263941,5.5018587360594798E-2,7.5836431226765796E-2,{"$f":"L817*100/B$1285","v":3604.2402826855123}]
["2020-03-31T17:00:00",13,"Abruzzo",335,73,408,783,1191,22,56,95,115,1401,8758,813,813,"",null,{"$f":"M818*100/M1331","v":1.3242967332123412},4,21,13,56,810,0.8501070663811563,6.7808708065667384E-2,8.2084225553176307E-2,{"$f":"L818*100/B$1285","v":4063.6042402826856}]
["2020-04-01T17:00:00",13,"Abruzzo",342,71,413,798,1211,20,35,102,123,1436,9610,813,813,"",null,{"$f":"M819*100/M1332","v":1.2986778085264168},-21,7,8,35,{"$f":"IF(N819-N818=0,\"\",N819-N818)","v":852},{"$f":"IF(M819=0,0,H819/M819)","v":0.84331476323119781},{"$f":"IF(M819=0,0,K819/M819)","v":7.1030640668523673E-2},{"$f":"IF(M819=0,0,L819/M819)","v":8.5654596100278549E-2},{"$f":"L819*100/B$1285","v":4346.2897526501765}]
["2020-04-02T17:00:00",13,"Abruzzo",341,75,416,835,1251,40,61,113,133,1497,10647,{"$f":"IF(P820=\"x2\",M820,O819)","v":813},{"$f":"IF(M820>O819*2,\"x2\",O819)","v":813},{"$f":"IF(P820=\"x2\",M820,\"\")","v":""},null,{"$f":"M820*100/M1333","v":1.2990055708856145},{"$f":"IF(J820-J819=0,\"\",J820-J819)","v":26},{"$f":"IF(K820-K819=0,\"\",K820-K819)","v":11},{"$f":"IF(L820-L819=0,\"\",L820-L819)","v":10},{"$f":"IF(M820-M819=0,\"\",M820-M819)","v":61},1037,0.83567134268537069,7.5484301937207746E-2,8.8844355377421511E-2,{"$f":"L820*100/B$1285","v":4699.6466431095405}]
["2020-04-03T17:00:00",13,"Abruzzo",361,76,437,864,1301,50,66,116,146,1563,11890,{"$f":"IF(P821=\"x2\",M821,O820)","v":813},{"$f":"IF(M821>O820*2,\"x2\",O820)","v":813},{"$f":"IF(P821=\"x2\",M821,\"\")","v":""},null,{"$f":"M821*100/M1334","v":1.30438048186135},{"$f":"IF(J821-J820=0,\"\",J821-J820)","v":5},{"$f":"IF(K821-K820=0,\"\",K821-K820)","v":3},{"$f":"IF(L821-L820=0,\"\",L821-L820)","v":13},{"$f":"IF(M821-M820=0,\"\",M821-M820)","v":66},1243,0.83237364043506079,7.4216250799744088E-2,9.3410108765195135E-2,{"$f":"L821*100/B$1285","v":5159.0106007067134}]
["2020-04-04T17:00:00",13,"Abruzzo",354,71,425,931,1356,55,65,119,153,1628,12837,{"$f":"IF(P822=\"x2\",M822,O821)","v":1628},{"$f":"IF(M822>O821*2,\"x2\",O821)","v":"x2"},{"$f":"IF(P822=\"x2\",M822,\"\")","v":1628},null,{"$f":"M822*100/M1335","v":1.306245587008152},{"$f":"IF(J822-J821=0,\"\",J822-J821)","v":-1},{"$f":"IF(K822-K821=0,\"\",K822-K821)","v":3},{"$f":"IF(L822-L821=0,\"\",L822-L821)","v":7},{"$f":"IF(M822-M821=0,\"\",M822-M821)","v":65},947,0.83292383292383287,7.309582309582309E-2,9.3980343980343981E-2,{"$f":"L822*100/B$1285","v":5406.3604240282684}]
["2020-04-05T17:00:00",13,"Abruzzo",347,67,414,1006,1420,64,75,125,158,1703,13598,{"$f":"IF(P823=\"x2\",M823,O822)","v":1628},{"$f":"IF(M823>O822*2,\"x2\",O822)","v":1628},{"$f":"IF(P823=\"x2\",M823,\"\")","v":""},null,{"$f":"M823*100/M1336","v":1.3206874088779974},{"$f":"IF(J823-J822=0,\"\",J823-J822)","v":10},{"$f":"IF(K823-K822=0,\"\",K823-K822)","v":6},{"$f":"IF(L823-L822=0,\"\",L823-L822)","v":5},{"$f":"IF(M823-M822=0,\"\",M823-M822)","v":75},761,0.83382266588373455,7.339988256018791E-2,9.2777451556077514E-2,{"$f":"L823*100/B$1285","v":5583.03886925795}]
["2020-04-06T17:00:00",13,"Abruzzo",340,66,406,1019,1425,5,18,127,169,1721,14198,{"$f":"IF(P824=\"x2\",M824,O823)","v":1628},{"$f":"IF(M824>O823*2,\"x2\",O823)","v":1628},{"$f":"IF(P824=\"x2\",M824,\"\")","v":""},null,{"$f":"M824*100/M1337","v":1.2984073573902088},{"$f":"IF(J824-J823=0,\"\",J824-J823)","v":-57},{"$f":"IF(K824-K823=0,\"\",K824-K823)","v":2},{"$f":"IF(L824-L823=0,\"\",L824-L823)","v":11},{"$f":"IF(M824-M823=0,\"\",M824-M823)","v":18},600,0.82800697269029633,7.3794305636257995E-2,9.8198721673445677E-2,{"$f":"L824*100/B$1285","v":5971.7314487632511}]
["2020-04-07T17:00:00",13,"Abruzzo",337,67,404,1087,1491,66,78,136,172,1799,14904,{"$f":"IF(P825=\"x2\",M825,O824)","v":1628},{"$f":"IF(M825>O824*2,\"x2\",O824)","v":1628},{"$f":"IF(P825=\"x2\",M825,\"\")","v":""},null,{"$f":"M825*100/M1338","v":1.3268331538654434},{"$f":"IF(J825-J824=0,\"\",J825-J824)","v":60},{"$f":"IF(K825-K824=0,\"\",K825-K824)","v":9},{"$f":"IF(L825-L824=0,\"\",L825-L824)","v":3},{"$f":"IF(M825-M824=0,\"\",M825-M824)","v":78},{"$f":"IF(N825-N824=0,\"\",N825-N824)","v":706},{"$f":"IF(M825=0,0,H825/M825)","v":0.8287937743190662},{"$f":"IF(M825=0,0,K825/M825)","v":7.5597554196775982E-2},{"$f":"IF(M825=0,0,L825/M825)","v":9.5608671484157859E-2},{"$f":"L825*100/B$1285","v":6077.7385159010601}]
["2020-04-08T17:00:00",13,"Abruzzo",331,62,393,1141,1534,43,60,146,179,1859,15846,{"$f":"IF(P826=\"x2\",M826,O825)","v":1628},{"$f":"IF(M826>O825*2,\"x2\",O825)","v":1628},{"$f":"IF(P826=\"x2\",M826,\"\")","v":""},null,{"$f":"M826*100/M1339","v":1.3333620232101102},{"$f":"IF(J826-J825=0,\"\",J826-J825)","v":-18},{"$f":"IF(K826-K825=0,\"\",K826-K825)","v":10},{"$f":"IF(L826-L825=0,\"\",L826-L825)","v":7},{"$f":"IF(M826-M825=0,\"\",M826-M825)","v":60},{"$f":"IF(N826-N825=0,\"\",N826-N825)","v":942},{"$f":"IF(M826=0,0,H826/M826)","v":0.82517482517482521},{"$f":"IF(M826=0,0,K826/M826)","v":7.8536847767617005E-2},{"$f":"IF(M826=0,0,L826/M826)","v":9.6288327057557827E-2},{"$f":"L826*100/B$1285","v":6325.0883392226151}]
["2020-04-09T17:00:00",13,"Abruzzo",306,57,363,1203,1566,32,72,171,194,1931,16847,{"$f":"IF(P827=\"x2\",M827,O826)","v":1628},{"$f":"IF(M827>O826*2,\"x2\",O826)","v":1628},{"$f":"IF(P827=\"x2\",M827,\"\")","v":""},null,{"$f":"M827*100/M1340","v":1.3444640942447745},{"$f":"IF(J827-J826=0,\"\",J827-J826)","v":12},{"$f":"IF(K827-K826=0,\"\",K827-K826)","v":25},{"$f":"IF(L827-L826=0,\"\",L827-L826)","v":15},{"$f":"IF(M827-M826=0,\"\",M827-M826)","v":72},{"$f":"IF(N827-N826=0,\"\",N827-N826)","v":1001},{"$f":"IF(M827=0,0,H827/M827)","v":0.81097876747799069},{"$f":"IF(M827=0,0,K827/M827)","v":8.8555152770585191E-2},{"$f":"IF(M827=0,0,L827/M827)","v":0.10046607975142413},{"$f":"L827*100/B$1285","v":6855.1236749116606}]
["2020-04-10T17:00:00",13,"Abruzzo",305,53,358,1277,1635,69,83,181,198,2014,18088,{"$f":"IF(P828=\"x2\",M828,O827)","v":1628},{"$f":"IF(M828>O827*2,\"x2\",O827)","v":1628},{"$f":"IF(P828=\"x2\",M828,\"\")","v":""},null,{"$f":"M828*100/M1341","v":1.3647113032518616},{"$f":"IF(J828-J827=0,\"\",J828-J827)","v":11},{"$f":"IF(K828-K827=0,\"\",K828-K827)","v":10},{"$f":"IF(L828-L827=0,\"\",L828-L827)","v":4},{"$f":"IF(M828-M827=0,\"\",M828-M827)","v":83},{"$f":"IF(N828-N827=0,\"\",N828-N827)","v":1241},{"$f":"IF(M828=0,0,H828/M828)","v":0.81181727904667333},{"$f":"IF(M828=0,0,K828/M828)","v":8.9870903674280037E-2},{"$f":"IF(M828=0,0,L828/M828)","v":9.831181727904667E-2},{"$f":"L828*100/B$1285","v":6996.4664310954058}]
["2020-04-11T17:00:00",13,"Abruzzo",315,54,369,1355,1724,89,106,190,206,2120,19441,{"$f":"IF(P829=\"x2\",M829,O828)","v":1628},{"$f":"IF(M829>O828*2,\"x2\",O828)","v":1628},{"$f":"IF(P829=\"x2\",M829,\"\")","v":""},null,{"$f":"M829*100/M1342","v":1.3922545987088808},{"$f":"IF(J829-J828=0,\"\",J829-J828)","v":23},{"$f":"IF(K829-K828=0,\"\",K829-K828)","v":9},{"$f":"IF(L829-L828=0,\"\",L829-L828)","v":8},{"$f":"IF(M829-M828=0,\"\",M829-M828)","v":106},{"$f":"IF(N829-N828=0,\"\",N829-N828)","v":1353},{"$f":"IF(M829=0,0,H829/M829)","v":0.81320754716981136},{"$f":"IF(M829=0,0,K829/M829)","v":8.9622641509433956E-2},{"$f":"IF(M829=0,0,L829/M829)","v":9.7169811320754723E-2},{"$f":"L829*100/B$1285","v":7279.1519434628972}]
["2020-04-12T17:00:00",13,"Abruzzo",346,54,400,1342,1742,18,40,206,212,2160,20594,{"$f":"IF(P830=\"x2\",M830,O829)","v":1628},{"$f":"IF(M830>O829*2,\"x2\",O829)","v":1628},{"$f":"IF(P830=\"x2\",M830,\"\")","v":""},null,{"$f":"M830*100/M1343","v":1.3814009708179045},{"$f":"IF(J830-J829=0,\"\",J830-J829)","v":-66},{"$f":"IF(K830-K829=0,\"\",K830-K829)","v":16},{"$f":"IF(L830-L829=0,\"\",L830-L829)","v":6},{"$f":"IF(M830-M829=0,\"\",M830-M829)","v":40},{"$f":"IF(N830-N829=0,\"\",N830-N829)","v":1153},{"$f":"IF(M830=0,0,H830/M830)","v":0.80648148148148147},{"$f":"IF(M830=0,0,K830/M830)","v":9.5370370370370369E-2},{"$f":"IF(M830=0,0,L830/M830)","v":9.8148148148148151E-2},{"$f":"L830*100/B$1285","v":7491.1660777385159}]
["2020-04-13T17:00:00",13,"Abruzzo",351,54,405,1373,1778,36,53,211,224,2213,20667,{"$f":"IF(P831=\"x2\",M831,O830)","v":1628},{"$f":"IF(M831>O830*2,\"x2\",O830)","v":1628},{"$f":"IF(P831=\"x2\",M831,\"\")","v":""},null,{"$f":"M831*100/M1344","v":1.3873216479851551},{"$f":"IF(J831-J830=0,\"\",J831-J830)","v":13},{"$f":"IF(K831-K830=0,\"\",K831-K830)","v":5},{"$f":"IF(L831-L830=0,\"\",L831-L830)","v":12},{"$f":"IF(M831-M830=0,\"\",M831-M830)","v":53},{"$f":"IF(N831-N830=0,\"\",N831-N830)","v":73},{"$f":"IF(M831=0,0,H831/M831)","v":0.80343425214640762},{"$f":"IF(M831=0,0,K831/M831)","v":9.5345684591052873E-2},{"$f":"IF(M831=0,0,L831/M831)","v":0.10122006326253954},{"$f":"L831*100/B$1285","v":7915.1943462897525}]
["2020-04-14T17:00:00",13,"Abruzzo",345,52,397,1403,1800,22,32,213,232,2245,20935,{"$f":"IF(P832=\"x2\",M832,O831)","v":1628},{"$f":"IF(M832>O831*2,\"x2\",O831)","v":1628},{"$f":"IF(P832=\"x2\",M832,\"\")","v":""},null,{"$f":"M832*100/M1345","v":1.3816404903746737},{"$f":"IF(J832-J831=0,\"\",J832-J831)","v":-21},{"$f":"IF(K832-K831=0,\"\",K832-K831)","v":2},{"$f":"IF(L832-L831=0,\"\",L832-L831)","v":8},{"$f":"IF(M832-M831=0,\"\",M832-M831)","v":32},{"$f":"IF(N832-N831=0,\"\",N832-N831)","v":268},{"$f":"IF(M832=0,0,H832/M832)","v":0.80178173719376389},{"$f":"IF(M832=0,0,K832/M832)","v":9.4877505567928733E-2},{"$f":"IF(M832=0,0,L832/M832)","v":0.10334075723830735},{"$f":"L832*100/B$1285","v":8197.8798586572429}]
["2020-04-15T17:00:00",13,"Abruzzo",341,44,385,1425,1810,10,29,224,240,2274,22500,{"$f":"IF(P833=\"x2\",M833,O832)","v":1628},{"$f":"IF(M833>O832*2,\"x2\",O832)","v":1628},{"$f":"IF(P833=\"x2\",M833,\"\")","v":""},null,{"$f":"M833*100/M1346","v":1.3768883775846932},{"$f":"IF(J833-J832=0,\"\",J833-J832)","v":-3},{"$f":"IF(K833-K832=0,\"\",K833-K832)","v":11},{"$f":"IF(L833-L832=0,\"\",L833-L832)","v":8},{"$f":"IF(M833-M832=0,\"\",M833-M832)","v":29},{"$f":"IF(N833-N832=0,\"\",N833-N832)","v":1565},{"$f":"IF(M833=0,0,H833/M833)","v":0.79595426561125771},{"$f":"IF(M833=0,0,K833/M833)","v":9.8504837291116976E-2},{"$f":"IF(M833=0,0,L833/M833)","v":0.10554089709762533},{"$f":"L833*100/B$1285","v":8480.5653710247352}]
[{"$f":"A833 + 1","v":"2020-04-16T17:00:00"},null,null,null,null,null,null,null,null,null,null,null,null,null,null,"Media x2",{"$f":"COUNT(M782:M833) / COUNT(Q782:Q833)","v":5.2}]
[{"$f":"A834+1","v":"2020-04-17T17:00:00"}]
[{"$f":"A835+1","v":"2020-04-18T17:00:00"}]
[null,null,null,null,{"$f":"E833/$M833","v":1.9349164467897976E-2},null,null,{"$f":"H833/$M833","v":0.79595426561125771},null,null,{"$f":"K833/$M833","v":9.8504837291116976E-2},{"$f":"L833/$M833","v":0.10554089709762533},null,{"$f":"N833/$M833","v":9.8944591029023741}]
[]
[]
[]
["Data","Codice","Regione","Ricoverati","Terap. Intens.","Ospedalizzati","Quarantena","Positivi","+ Positivi","Nuovi","Guariti","Deceduti","Totale","Tamponi",null,null,"x 2",null,"% su Tot.","+ Nuovi","+ Guariti","+ Deceduti","+ Totali","+ Tamponi","% Positivi","% Guariti","% Deceduti","P. Stimati"]
["2020-02-24T18:00:00",14,"Molise",0,0,0,0,0,0,0,0,0,0,0,{"$f":"M842","v":0},null,{"$f":"M842","v":0},null,{"$f":"M842*100/M1295","v":0},null,null,null,null,null,{"$f":"IF(M842=0,0,H842/M842)","v":0},{"$f":"IF(M842=0,0,K842/M842)","v":0},{"$f":"IF(M842=0,0,L842/M842)","v":0},{"$f":"L842*100/B$1285","v":0}]
["2020-02-25T18:00:00",14,"Molise",0,0,0,0,0,0,0,0,0,0,0,{"$f":"IF(P843=\"x2\",M843,O842)","v":0},{"$f":"IF(M843>O842*2,\"x2\",O842)","v":0},{"$f":"IF(P843=\"x2\",M843,\"\")","v":""},null,{"$f":"M843*100/M1296","v":0},{"$f":"IF(J843-J842=0,\"\",J843-J842)","v":""},{"$f":"IF(K843-K842=0,\"\",K843-K842)","v":""},{"$f":"IF(L843-L842=0,\"\",L843-L842)","v":""},{"$f":"IF(M843-M842=0,\"\",M843-M842)","v":""},{"$f":"IF(N843-N842=0,\"\",N843-N842)","v":""},0,0,0,{"$f":"L843*100/B$1285","v":0}]
["2020-02-26T18:00:00",14,"Molise",0,0,0,0,0,0,0,0,0,0,0,0,0,"",null,{"$f":"M844*100/M1297","v":0},"","","","","",0,0,0,{"$f":"L844*100/B$1285","v":0}]
["2020-02-27T18:00:00",14,"Molise",0,0,0,0,0,0,0,0,0,0,0,0,0,"",null,{"$f":"M845*100/M1298","v":0},"","","","","",0,0,0,{"$f":"L845*100/B$1285","v":0}]
["2020-02-28T18:00:00",14,"Molise",0,0,0,0,0,0,0,0,0,0,0,0,0,"",null,{"$f":"M846*100/M1299","v":0},"","","","","",0,0,0,{"$f":"L846*100/B$1285","v":0}]
["2020-02-29T17:00:00",14,"Molise",0,0,0,0,0,0,0,0,0,0,0,0,0,"",null,{"$f":"M847*100/M1300","v":0},"","","","","",0,0,0,{"$f":"L847*100/B$1285","v":0}]
["2020-03-01T17:00:00",14,"Molise",0,0,0,0,0,0,0,0,0,0,6,0,0,"",null,{"$f":"M848*100/M1301","v":0},"","","","",6,0,0,0,{"$f":"L848*100/B$1285","v":0}]
["2020-03-02T18:00:00",14,"Molise",0,0,0,0,0,0,0,0,0,0,13,0,0,"",null,{"$f":"M849*100/M1302","v":0},"","","","",7,0,0,0,{"$f":"L849*100/B$1285","v":0}]
["2020-03-03T18:00:00",14,"Molise",3,0,3,0,3,3,3,0,0,3,13,3,"x2",3,null,{"$f":"M850*100/M1303","v":0.11990407673860912},3,"","",3,"",1,0,0,{"$f":"L850*100/B$1285","v":0}]
["2020-03-04T17:00:00",14,"Molise",3,0,3,0,3,0,0,0,0,3,19,3,3,"",null,{"$f":"M851*100/M1304","v":9.711880867594691E-2},-3,"","","",6,1,0,0,{"$f":"L851*100/B$1285","v":0}]
["2020-03-05T17:00:00",14,"Molise",4,0,4,3,7,4,4,0,0,7,24,7,"x2",7,null,{"$f":"M852*100/M1305","v":0.18144116122343182},4,"","",4,5,1,0,0,{"$f":"L852*100/B$1285","v":0}]
["2020-03-06T17:00:00",14,"Molise",3,2,5,7,12,5,5,0,0,12,104,7,7,"",null,{"$f":"M853*100/M1306","v":0.25884383088869717},1,"","",5,80,1,0,0,{"$f":"L853*100/B$1285","v":0}]
["2020-03-07T18:00:00",14,"Molise",3,2,5,9,14,2,2,0,0,14,112,7,7,"",null,{"$f":"M854*100/M1307","v":0.23797382287948327},-3,"","",2,8,1,0,0,{"$f":"L854*100/B$1285","v":0}]
["2020-03-08T18:00:00",14,"Molise",4,2,6,8,14,0,0,0,0,14,116,7,7,"",null,{"$f":"M855*100/M1308","v":0.18983050847457628},-2,"","","",4,1,0,0,{"$f":"L855*100/B$1285","v":0}]
["2020-03-09T18:00:00",14,"Molise",4,2,6,8,14,0,0,0,0,14,212,7,7,"",null,{"$f":"M856*100/M1309","v":0.15263846489315308},"","","","",96,1,0,0,{"$f":"L856*100/B$1285","v":0}]
["2020-03-10T18:00:00",14,"Molise",3,3,6,9,15,1,1,0,0,15,225,15,"x2",15,null,{"$f":"M857*100/M1310","v":0.14779781259237362},1,"","",1,13,1,0,0,{"$f":"L857*100/B$1285","v":0}]
["2020-03-11T17:00:00",14,"Molise",4,3,7,9,16,1,1,0,0,16,233,15,15,"",null,{"$f":"M858*100/M1311","v":0.12839030653185685},"","","",1,8,1,0,0,{"$f":"L858*100/B$1285","v":0}]
["2020-03-12T17:00:00",14,"Molise",4,3,7,9,16,0,0,0,0,16,238,15,15,"",null,{"$f":"M859*100/M1312","v":0.10586911930126382},-1,"","","",5,1,0,0,{"$f":"L859*100/B$1285","v":0}]
["2020-03-13T17:00:00",14,"Molise",5,3,8,9,17,1,1,0,0,17,243,15,15,"",null,{"$f":"M860*100/M1313","v":9.6262740656851642E-2},1,"","",1,5,1,0,0,{"$f":"L860*100/B$1285","v":0}]
["2020-03-14T17:00:00",14,"Molise",5,3,8,9,17,0,0,0,0,17,247,15,15,"",null,{"$f":"M861*100/M1314","v":8.0351656662097648E-2},-1,"","","",4,1,0,0,{"$f":"L861*100/B$1285","v":0}]
["2020-03-15T17:00:00",14,"Molise",3,4,7,10,17,0,0,0,0,17,248,15,15,"",null,{"$f":"M862*100/M1315","v":6.8695195377217438E-2},"","","","",1,1,0,0,{"$f":"L862*100/B$1285","v":0}]
["2020-03-16T17:00:00",14,"Molise",3,5,8,7,15,-2,-2,5,1,21,253,15,15,"",null,{"$f":"M863*100/M1316","v":7.5053609721229445E-2},-2,5,1,4,5,0.7142857142857143,0.23809523809523808,4.7619047619047616E-2,{"$f":"L863*100/B$1285","v":35.335689045936398}]
["2020-03-17T17:00:00",14,"Molise",7,5,12,7,19,4,4,5,1,25,301,15,15,"",null,{"$f":"M864*100/M1317","v":7.9349965086015356E-2},6,"","",4,48,0.76,0.2,0.04,{"$f":"L864*100/B$1285","v":35.335689045936398}]
["2020-03-18T17:00:00",14,"Molise",7,6,13,8,21,2,2,6,1,28,361,15,15,"",null,{"$f":"M865*100/M1318","v":7.8402822501610056E-2},-2,1,"",3,60,0.75,0.21428571428571427,3.5714285714285712E-2,{"$f":"L865*100/B$1285","v":35.335689045936398}]
["2020-03-19T17:00:00",14,"Molise",19,6,25,13,38,17,17,6,2,46,426,46,"x2",46,null,{"$f":"M866*100/M1319","v":0.11209942731814306},15,"",1,18,65,0.82608695652173914,0.13043478260869565,4.3478260869565216E-2,{"$f":"L866*100/B$1285","v":70.671378091872796}]
["2020-03-20T17:00:00",14,"Molise",20,6,26,13,39,1,1,6,5,50,426,46,46,"",null,{"$f":"M867*100/M1320","v":0.10633546713170711},-16,"",3,4,{"$f":"IF(N867-N866=0,\"\",N867-N866)","v":""},0.78,0.12,0.1,{"$f":"L867*100/B$1285","v":176.67844522968198}]
["2020-03-21T17:00:00",14,"Molise",21,6,27,20,47,8,8,7,7,61,449,46,46,"",null,{"$f":"M868*100/M1321","v":0.11385270073537646},7,1,2,{"$f":"IF(M868-M867=0,\"\",M868-M867)","v":11},23,0.77049180327868849,0.11475409836065574,0.11475409836065574,{"$f":"L868*100/B$1285","v":247.34982332155477}]
["2020-03-22T17:00:00",14,"Molise",24,7,31,21,52,5,5,7,7,66,532,46,46,"",null,{"$f":"M869*100/M1322","v":0.1116033683925733},-3,"","",5,83,0.78787878787878785,0.10606060606060606,0.10606060606060606,{"$f":"L869*100/B$1285","v":247.34982332155477}]
["2020-03-23T17:00:00",14,"Molise",25,7,32,18,50,-2,-2,10,7,67,532,46,46,"",null,{"$f":"M870*100/M1323","v":0.10480704553631486},-7,3,"",1,"",0.74626865671641796,0.14925373134328357,0.1044776119402985,{"$f":"L870*100/B$1285","v":247.34982332155477}]
["2020-03-24T17:00:00",14,"Molise",27,7,34,21,55,5,5,10,8,73,572,46,46,"",null,{"$f":"M871*100/M1324","v":0.10552792876142014},7,"",1,6,40,0.75342465753424659,0.13698630136986301,0.1095890410958904,{"$f":"L871*100/B$1285","v":282.68551236749119}]
["2020-03-25T17:00:00",14,"Molise",26,7,33,20,53,-2,-2,12,8,73,580,46,46,"",null,{"$f":"M872*100/M1325","v":9.8136746161912189E-2},-7,2,"","",8,0.72602739726027399,0.16438356164383561,0.1095890410958904,{"$f":"L872*100/B$1285","v":282.68551236749119}]
["2020-03-26T17:00:00",14,"Molise",27,8,35,46,81,28,28,14,8,103,670,103,"x2",103,null,{"$f":"M873*100/M1326","v":0.12788835222687145},30,2,"",30,{"$f":"IF(N873-N872=0,\"\",N873-N872)","v":90},0.78640776699029125,0.13592233009708737,7.7669902912621352E-2,{"$f":"L873*100/B$1285","v":282.68551236749119}]
["2020-03-27T17:00:00",14,"Molise",26,9,35,51,86,5,6,14,9,109,710,{"$f":"IF(P874=\"x2\",M874,O873)","v":103},{"$f":"IF(M874>O873*2,\"x2\",O873)","v":103},{"$f":"IF(P874=\"x2\",M874,\"\")","v":""},null,{"$f":"M874*100/M1327","v":0.12601447432310572},{"$f":"IF(J874-J873=0,\"\",J874-J873)","v":-22},"",1,6,40,0.78899082568807344,0.12844036697247707,8.2568807339449546E-2,{"$f":"L874*100/B$1285","v":318.02120141342755}]
["2020-03-28T17:00:00",14,"Molise",26,9,35,63,98,12,14,16,9,123,807,103,103,"",null,{"$f":"M875*100/M1328","v":0.13301323643913834},8,2,"",14,97,0.7967479674796748,0.13008130081300814,7.3170731707317069E-2,{"$f":"L875*100/B$1285","v":318.02120141342755}]
["2020-03-29T17:00:00",14,"Molise",25,9,34,66,100,2,4,18,9,127,918,103,103,"",null,{"$f":"M876*100/M1329","v":0.1300044017238379},-10,2,"",4,111,0.78740157480314965,0.14173228346456693,7.0866141732283464E-2,{"$f":"L876*100/B$1285","v":318.02120141342755}]
["2020-03-30T17:00:00",14,"Molise",27,8,35,72,107,7,7,18,9,134,955,103,103,"",null,{"$f":"M877*100/M1330","v":0.13170957056782551},3,"","",7,37,0.79850746268656714,0.13432835820895522,6.7164179104477612E-2,{"$f":"L877*100/B$1285","v":318.02120141342755}]
["2020-03-31T17:00:00",14,"Molise",29,8,37,80,117,10,10,18,9,144,1049,103,103,"",null,{"$f":"M878*100/M1331","v":0.13611615245009073},3,"","",10,94,0.8125,0.125,6.25E-2,{"$f":"L878*100/B$1285","v":318.02120141342755}]
["2020-04-01T17:00:00",14,"Molise",32,8,40,91,131,14,16,19,10,160,1157,103,103,"",null,{"$f":"M879*100/M1332","v":0.14469947727313834},6,1,1,16,{"$f":"IF(N879-N878=0,\"\",N879-N878)","v":108},{"$f":"IF(M879=0,0,H879/M879)","v":0.81874999999999998},{"$f":"IF(M879=0,0,K879/M879)","v":0.11874999999999999},{"$f":"IF(M879=0,0,L879/M879)","v":6.25E-2},{"$f":"L879*100/B$1285","v":353.35689045936397}]
["2020-04-02T17:00:00",14,"Molise",30,8,38,95,133,2,5,21,11,165,1229,{"$f":"IF(P880=\"x2\",M880,O879)","v":103},{"$f":"IF(M880>O879*2,\"x2\",O879)","v":103},{"$f":"IF(P880=\"x2\",M880,\"\")","v":""},null,{"$f":"M880*100/M1333","v":0.14317696673087937},{"$f":"IF(J880-J879=0,\"\",J880-J879)","v":-11},{"$f":"IF(K880-K879=0,\"\",K880-K879)","v":2},{"$f":"IF(L880-L879=0,\"\",L880-L879)","v":1},{"$f":"IF(M880-M879=0,\"\",M880-M879)","v":5},72,0.80606060606060603,0.12727272727272726,6.6666666666666666E-2,{"$f":"L880*100/B$1285","v":388.69257950530033}]
["2020-04-03T17:00:00",14,"Molise",31,8,39,105,144,11,11,21,11,176,1378,{"$f":"IF(P881=\"x2\",M881,O880)","v":103},{"$f":"IF(M881>O880*2,\"x2\",O880)","v":103},{"$f":"IF(P881=\"x2\",M881,\"\")","v":""},null,{"$f":"M881*100/M1334","v":0.14687841638361973},{"$f":"IF(J881-J880=0,\"\",J881-J880)","v":6},{"$f":"IF(K881-K880=0,\"\",K881-K880)","v":""},{"$f":"IF(L881-L880=0,\"\",L881-L880)","v":""},{"$f":"IF(M881-M880=0,\"\",M881-M880)","v":11},149,0.81818181818181823,0.11931818181818182,6.25E-2,{"$f":"L881*100/B$1285","v":388.69257950530033}]
["2020-04-04T17:00:00",14,"Molise",31,6,37,134,171,27,30,24,11,206,1504,{"$f":"IF(P882=\"x2\",M882,O881)","v":103},{"$f":"IF(M882>O881*2,\"x2\",O881)","v":103},{"$f":"IF(P882=\"x2\",M882,\"\")","v":""},null,{"$f":"M882*100/M1335","v":0.16528660376147378},{"$f":"IF(J882-J881=0,\"\",J882-J881)","v":19},{"$f":"IF(K882-K881=0,\"\",K882-K881)","v":3},{"$f":"IF(L882-L881=0,\"\",L882-L881)","v":""},{"$f":"IF(M882-M881=0,\"\",M882-M881)","v":30},126,0.83009708737864074,0.11650485436893204,5.3398058252427182E-2,{"$f":"L882*100/B$1285","v":388.69257950530033}]
["2020-04-05T17:00:00",14,"Molise",33,6,39,148,187,16,18,24,13,224,1504,{"$f":"IF(P883=\"x2\",M883,O882)","v":224},{"$f":"IF(M883>O882*2,\"x2\",O882)","v":"x2"},{"$f":"IF(P883=\"x2\",M883,\"\")","v":224},null,{"$f":"M883*100/M1336","v":0.17371343487297206},{"$f":"IF(J883-J882=0,\"\",J883-J882)","v":-12},{"$f":"IF(K883-K882=0,\"\",K883-K882)","v":""},{"$f":"IF(L883-L882=0,\"\",L883-L882)","v":2},{"$f":"IF(M883-M882=0,\"\",M883-M882)","v":18},"",0.8348214285714286,0.10714285714285714,5.8035714285714288E-2,{"$f":"L883*100/B$1285","v":459.36395759717311}]
["2020-04-06T17:00:00",14,"Molise",34,5,39,148,187,0,0,24,13,224,1546,{"$f":"IF(P884=\"x2\",M884,O883)","v":224},{"$f":"IF(M884>O883*2,\"x2\",O883)","v":224},{"$f":"IF(P884=\"x2\",M884,\"\")","v":""},null,{"$f":"M884*100/M1337","v":0.16899665778931247},{"$f":"IF(J884-J883=0,\"\",J884-J883)","v":-18},{"$f":"IF(K884-K883=0,\"\",K884-K883)","v":""},{"$f":"IF(L884-L883=0,\"\",L884-L883)","v":""},{"$f":"IF(M884-M883=0,\"\",M884-M883)","v":""},42,0.8348214285714286,0.10714285714285714,5.8035714285714288E-2,{"$f":"L884*100/B$1285","v":459.36395759717311}]
["2020-04-07T17:00:00",14,"Molise",35,5,40,145,185,-2,0,26,13,224,1581,{"$f":"IF(P885=\"x2\",M885,O884)","v":224},{"$f":"IF(M885>O884*2,\"x2\",O884)","v":224},{"$f":"IF(P885=\"x2\",M885,\"\")","v":""},null,{"$f":"M885*100/M1338","v":0.16520879736845986},{"$f":"IF(J885-J884=0,\"\",J885-J884)","v":""},{"$f":"IF(K885-K884=0,\"\",K885-K884)","v":2},{"$f":"IF(L885-L884=0,\"\",L885-L884)","v":""},{"$f":"IF(M885-M884=0,\"\",M885-M884)","v":""},{"$f":"IF(N885-N884=0,\"\",N885-N884)","v":35},{"$f":"IF(M885=0,0,H885/M885)","v":0.8258928571428571},{"$f":"IF(M885=0,0,K885/M885)","v":0.11607142857142858},{"$f":"IF(M885=0,0,L885/M885)","v":5.8035714285714288E-2},{"$f":"L885*100/B$1285","v":459.36395759717311}]
["2020-04-08T17:00:00",14,"Molise",30,4,34,147,181,-4,2,32,13,226,2002,{"$f":"IF(P886=\"x2\",M886,O885)","v":224},{"$f":"IF(M886>O885*2,\"x2\",O885)","v":224},{"$f":"IF(P886=\"x2\",M886,\"\")","v":""},null,{"$f":"M886*100/M1339","v":0.16209780378993272},{"$f":"IF(J886-J885=0,\"\",J886-J885)","v":2},{"$f":"IF(K886-K885=0,\"\",K886-K885)","v":6},{"$f":"IF(L886-L885=0,\"\",L886-L885)","v":""},{"$f":"IF(M886-M885=0,\"\",M886-M885)","v":2},{"$f":"IF(N886-N885=0,\"\",N886-N885)","v":421},{"$f":"IF(M886=0,0,H886/M886)","v":0.80088495575221241},{"$f":"IF(M886=0,0,K886/M886)","v":0.1415929203539823},{"$f":"IF(M886=0,0,L886/M886)","v":5.7522123893805309E-2},{"$f":"L886*100/B$1285","v":459.36395759717311}]
["2020-04-09T17:00:00",14,"Molise",30,4,34,155,189,8,8,32,13,234,2069,{"$f":"IF(P887=\"x2\",M887,O886)","v":224},{"$f":"IF(M887>O886*2,\"x2\",O886)","v":224},{"$f":"IF(P887=\"x2\",M887,\"\")","v":""},null,{"$f":"M887*100/M1340","v":0.16292314761951179},{"$f":"IF(J887-J886=0,\"\",J887-J886)","v":6},{"$f":"IF(K887-K886=0,\"\",K887-K886)","v":""},{"$f":"IF(L887-L886=0,\"\",L887-L886)","v":""},{"$f":"IF(M887-M886=0,\"\",M887-M886)","v":8},{"$f":"IF(N887-N886=0,\"\",N887-N886)","v":67},{"$f":"IF(M887=0,0,H887/M887)","v":0.80769230769230771},{"$f":"IF(M887=0,0,K887/M887)","v":0.13675213675213677},{"$f":"IF(M887=0,0,L887/M887)","v":5.5555555555555552E-2},{"$f":"L887*100/B$1285","v":459.36395759717311}]
["2020-04-10T17:00:00",14,"Molise",28,4,32,161,193,4,9,37,13,243,2069,{"$f":"IF(P888=\"x2\",M888,O887)","v":224},{"$f":"IF(M888>O887*2,\"x2\",O887)","v":224},{"$f":"IF(P888=\"x2\",M888,\"\")","v":""},null,{"$f":"M888*100/M1341","v":0.16465980471211639},{"$f":"IF(J888-J887=0,\"\",J888-J887)","v":1},{"$f":"IF(K888-K887=0,\"\",K888-K887)","v":5},{"$f":"IF(L888-L887=0,\"\",L888-L887)","v":""},{"$f":"IF(M888-M887=0,\"\",M888-M887)","v":9},{"$f":"IF(N888-N887=0,\"\",N888-N887)","v":""},{"$f":"IF(M888=0,0,H888/M888)","v":0.79423868312757206},{"$f":"IF(M888=0,0,K888/M888)","v":0.15226337448559671},{"$f":"IF(M888=0,0,L888/M888)","v":5.3497942386831275E-2},{"$f":"L888*100/B$1285","v":459.36395759717311}]
["2020-04-11T17:00:00",14,"Molise",28,4,32,161,193,0,3,39,14,246,2201,{"$f":"IF(P889=\"x2\",M889,O888)","v":224},{"$f":"IF(M889>O888*2,\"x2\",O888)","v":224},{"$f":"IF(P889=\"x2\",M889,\"\")","v":""},null,{"$f":"M889*100/M1342","v":0.16155407135961541},{"$f":"IF(J889-J888=0,\"\",J889-J888)","v":-6},{"$f":"IF(K889-K888=0,\"\",K889-K888)","v":2},{"$f":"IF(L889-L888=0,\"\",L889-L888)","v":1},{"$f":"IF(M889-M888=0,\"\",M889-M888)","v":3},{"$f":"IF(N889-N888=0,\"\",N889-N888)","v":132},{"$f":"IF(M889=0,0,H889/M889)","v":0.78455284552845528},{"$f":"IF(M889=0,0,K889/M889)","v":0.15853658536585366},{"$f":"IF(M889=0,0,L889/M889)","v":5.6910569105691054E-2},{"$f":"L889*100/B$1285","v":494.69964664310953}]
["2020-04-12T17:00:00",14,"Molise",27,4,31,171,202,9,11,40,15,257,2471,{"$f":"IF(P890=\"x2\",M890,O889)","v":224},{"$f":"IF(M890>O889*2,\"x2\",O889)","v":224},{"$f":"IF(P890=\"x2\",M890,\"\")","v":""},null,{"$f":"M890*100/M1343","v":0.16436113402787103},{"$f":"IF(J890-J889=0,\"\",J890-J889)","v":8},{"$f":"IF(K890-K889=0,\"\",K890-K889)","v":1},{"$f":"IF(L890-L889=0,\"\",L890-L889)","v":1},{"$f":"IF(M890-M889=0,\"\",M890-M889)","v":11},{"$f":"IF(N890-N889=0,\"\",N890-N889)","v":270},{"$f":"IF(M890=0,0,H890/M890)","v":0.78599221789883267},{"$f":"IF(M890=0,0,K890/M890)","v":0.1556420233463035},{"$f":"IF(M890=0,0,L890/M890)","v":5.8365758754863814E-2},{"$f":"L890*100/B$1285","v":530.03533568904595}]
["2020-04-13T17:00:00",14,"Molise",28,4,32,170,202,0,0,40,15,257,2522,{"$f":"IF(P891=\"x2\",M891,O890)","v":224},{"$f":"IF(M891>O890*2,\"x2\",O890)","v":224},{"$f":"IF(P891=\"x2\",M891,\"\")","v":""},null,{"$f":"M891*100/M1344","v":0.1611123649038341},{"$f":"IF(J891-J890=0,\"\",J891-J890)","v":-11},{"$f":"IF(K891-K890=0,\"\",K891-K890)","v":""},{"$f":"IF(L891-L890=0,\"\",L891-L890)","v":""},{"$f":"IF(M891-M890=0,\"\",M891-M890)","v":""},{"$f":"IF(N891-N890=0,\"\",N891-N890)","v":51},{"$f":"IF(M891=0,0,H891/M891)","v":0.78599221789883267},{"$f":"IF(M891=0,0,K891/M891)","v":0.1556420233463035},{"$f":"IF(M891=0,0,L891/M891)","v":5.8365758754863814E-2},{"$f":"L891*100/B$1285","v":530.03533568904595}]
["2020-04-14T17:00:00",14,"Molise",26,4,30,170,200,-2,0,42,15,257,2522,{"$f":"IF(P892=\"x2\",M892,O891)","v":224},{"$f":"IF(M892>O891*2,\"x2\",O891)","v":224},{"$f":"IF(P892=\"x2\",M892,\"\")","v":""},null,{"$f":"M892*100/M1345","v":0.15816552606961745},{"$f":"IF(J892-J891=0,\"\",J892-J891)","v":""},{"$f":"IF(K892-K891=0,\"\",K892-K891)","v":2},{"$f":"IF(L892-L891=0,\"\",L892-L891)","v":""},{"$f":"IF(M892-M891=0,\"\",M892-M891)","v":""},{"$f":"IF(N892-N891=0,\"\",N892-N891)","v":""},{"$f":"IF(M892=0,0,H892/M892)","v":0.77821011673151752},{"$f":"IF(M892=0,0,K892/M892)","v":0.16342412451361868},{"$f":"IF(M892=0,0,L892/M892)","v":5.8365758754863814E-2},{"$f":"L892*100/B$1285","v":530.03533568904595}]
["2020-04-15T17:00:00",14,"Molise",27,4,31,175,206,6,6,42,15,263,2855,{"$f":"IF(P893=\"x2\",M893,O892)","v":224},{"$f":"IF(M893>O892*2,\"x2\",O892)","v":224},{"$f":"IF(P893=\"x2\",M893,\"\")","v":""},null,{"$f":"M893*100/M1346","v":0.15924434622021738},{"$f":"IF(J893-J892=0,\"\",J893-J892)","v":6},{"$f":"IF(K893-K892=0,\"\",K893-K892)","v":""},{"$f":"IF(L893-L892=0,\"\",L893-L892)","v":""},{"$f":"IF(M893-M892=0,\"\",M893-M892)","v":6},{"$f":"IF(N893-N892=0,\"\",N893-N892)","v":333},{"$f":"IF(M893=0,0,H893/M893)","v":0.78326996197718635},{"$f":"IF(M893=0,0,K893/M893)","v":0.1596958174904943},{"$f":"IF(M893=0,0,L893/M893)","v":5.7034220532319393E-2},{"$f":"L893*100/B$1285","v":530.03533568904595}]
[{"$f":"A893 + 1","v":"2020-04-16T17:00:00"},null,null,null,null,null,null,null,null,null,null,null,null,null,null,"Media x2",{"$f":"COUNT(M842:M893) / COUNT(Q842:Q893)","v":7.4285714285714288}]
[{"$f":"A894+1","v":"2020-04-17T17:00:00"}]
[{"$f":"A895+1","v":"2020-04-18T17:00:00"}]
[null,null,null,null,{"$f":"E893/$M893","v":1.5209125475285171E-2},null,null,{"$f":"H893/$M893","v":0.78326996197718635},null,null,{"$f":"K893/$M893","v":0.1596958174904943},{"$f":"L893/$M893","v":5.7034220532319393E-2},null,{"$f":"N893/$M893","v":10.855513307984792}]
[]
[]
[]
["Data","Codice","Regione","Ricoverati","Terap. Intens.","Ospedalizzati","Quarantena","Positivi","+ Positivi","Nuovi","Guariti","Deceduti","Totale","Tamponi",null,null,"x 2",null,"% su Tot.","+ Nuovi","+ Guariti","+ Deceduti","+ Totali","+ Tamponi","% Positivi","% Guariti","% Deceduti","P. Stimati"]
["2020-02-24T18:00:00",15,"Campania",0,0,0,0,0,0,0,0,0,0,10,{"$f":"M902","v":0},null,{"$f":"M902","v":0},null,{"$f":"M902*100/M1295","v":0},null,null,null,null,null,{"$f":"IF(M902=0,0,H902/M902)","v":0},{"$f":"IF(M902=0,0,K902/M902)","v":0},{"$f":"IF(M902=0,0,L902/M902)","v":0},{"$f":"L902*100/B$1285","v":0}]
["2020-02-25T18:00:00",15,"Campania",0,0,0,0,0,0,0,0,0,0,10,{"$f":"IF(P903=\"x2\",M903,O902)","v":0},{"$f":"IF(M903>O902*2,\"x2\",O902)","v":0},{"$f":"IF(P903=\"x2\",M903,\"\")","v":""},null,{"$f":"M903*100/M1296","v":0},{"$f":"IF(J903-J902=0,\"\",J903-J902)","v":""},{"$f":"IF(K903-K902=0,\"\",K903-K902)","v":""},{"$f":"IF(L903-L902=0,\"\",L903-L902)","v":""},{"$f":"IF(M903-M902=0,\"\",M903-M902)","v":""},{"$f":"IF(N903-N902=0,\"\",N903-N902)","v":""},0,0,0,{"$f":"L903*100/B$1285","v":0}]
["2020-02-26T18:00:00",15,"Campania",0,0,0,0,0,0,0,0,0,0,10,0,0,"",null,{"$f":"M904*100/M1297","v":0},"","","","","",0,0,0,{"$f":"L904*100/B$1285","v":0}]
["2020-02-27T18:00:00",15,"Campania",2,0,2,1,3,3,3,0,0,3,10,3,"x2",3,null,{"$f":"M905*100/M1298","v":0.46153846153846156},3,"","",3,"",1,0,0,{"$f":"L905*100/B$1285","v":0}]
["2020-02-28T18:00:00",15,"Campania",2,0,2,2,4,1,1,0,0,4,213,3,3,"",null,{"$f":"M906*100/M1299","v":0.45045045045045046},-2,"","",1,203,1,0,0,{"$f":"L906*100/B$1285","v":0}]
["2020-02-29T17:00:00",15,"Campania",3,0,3,10,13,9,9,0,0,13,373,13,"x2",13,null,{"$f":"M907*100/M1300","v":1.1524822695035462},8,"","",9,160,1,0,0,{"$f":"L907*100/B$1285","v":0}]
["2020-03-01T17:00:00",15,"Campania",4,0,4,13,17,4,4,0,0,17,373,13,13,"",null,{"$f":"M908*100/M1301","v":1.0035419126328218},-5,"","",4,"",1,0,0,{"$f":"L908*100/B$1285","v":0}]
["2020-03-02T18:00:00",15,"Campania",4,0,4,13,17,0,0,0,0,17,373,13,13,"",null,{"$f":"M909*100/M1302","v":0.83497053045186642},-4,"","","","",1,0,0,{"$f":"L909*100/B$1285","v":0}]
["2020-03-03T18:00:00",15,"Campania",11,0,11,19,30,13,13,0,0,30,405,30,"x2",30,null,{"$f":"M910*100/M1303","v":1.1990407673860912},13,"","",13,32,1,0,0,{"$f":"L910*100/B$1285","v":0}]
["2020-03-04T17:00:00",15,"Campania",11,0,11,20,31,1,1,0,0,31,429,30,30,"",null,{"$f":"M911*100/M1304","v":1.0035610229847847},-12,"","",1,24,1,0,0,{"$f":"L911*100/B$1285","v":0}]
["2020-03-05T17:00:00",15,"Campania",12,0,12,33,45,14,14,0,0,45,471,30,30,"",null,{"$f":"M912*100/M1305","v":1.166407465007776},13,"","",14,42,1,0,0,{"$f":"L912*100/B$1285","v":0}]
["2020-03-06T17:00:00",15,"Campania",12,0,12,45,57,12,12,0,0,57,471,30,30,"",null,{"$f":"M913*100/M1306","v":1.2295081967213115},-2,"","",12,"",1,0,0,{"$f":"L913*100/B$1285","v":0}]
["2020-03-07T18:00:00",15,"Campania",16,0,16,45,61,4,4,0,0,61,612,61,"x2",61,null,{"$f":"M914*100/M1307","v":1.0368859425463199},-8,"","",4,141,1,0,0,{"$f":"L914*100/B$1285","v":0}]
["2020-03-08T18:00:00",15,"Campania",30,7,37,63,100,39,39,1,0,101,980,61,61,"",null,{"$f":"M915*100/M1308","v":1.3694915254237288},35,1,"",40,368,0.99009900990099009,9.9009900990099011E-3,0,{"$f":"L915*100/B$1285","v":0}]
["2020-03-09T18:00:00",15,"Campania",42,8,50,69,119,19,19,1,0,120,980,61,61,"",null,{"$f":"M916*100/M1309","v":1.3083296990841693},-20,"","",19,"",0.9916666666666667,8.3333333333333332E-3,0,{"$f":"L916*100/B$1285","v":0}]
["2020-03-10T18:00:00",15,"Campania",33,8,41,85,126,7,7,1,0,127,1141,127,"x2",127,null,{"$f":"M917*100/M1310","v":1.2513548132820969},-12,"","",7,161,0.99212598425196852,7.874015748031496E-3,0,{"$f":"L917*100/B$1285","v":0}]
["2020-03-11T17:00:00",15,"Campania",56,11,67,82,149,23,23,4,1,154,1375,127,127,"",null,{"$f":"M918*100/M1311","v":1.2357567003691221},16,3,1,27,234,0.96753246753246758,2.5974025974025976E-2,6.4935064935064939E-3,{"$f":"L918*100/B$1285","v":35.335689045936398}]
["2020-03-12T17:00:00",15,"Campania",56,11,67,107,174,25,25,4,1,179,1551,127,127,"",null,{"$f":"M919*100/M1312","v":1.1844107721828889},2,"","",25,176,0.97206703910614523,2.23463687150838E-2,5.5865921787709499E-3,{"$f":"L919*100/B$1285","v":35.335689045936398}]
["2020-03-13T17:00:00",15,"Campania",60,19,79,134,213,39,39,5,2,220,1671,127,127,"",null,{"$f":"M920*100/M1313","v":1.245753114382786},14,1,1,41,120,0.96818181818181814,2.2727272727272728E-2,9.0909090909090905E-3,{"$f":"L920*100/B$1285","v":70.671378091872796}]
["2020-03-14T17:00:00",15,"Campania",72,17,89,154,243,30,30,23,6,272,1936,272,"x2",272,null,{"$f":"M921*100/M1314","v":1.2856265065935624},-9,18,4,52,265,0.89338235294117652,8.455882352941177E-2,2.2058823529411766E-2,{"$f":"L921*100/B$1285","v":212.01413427561837}]
["2020-03-15T17:00:00",15,"Campania",73,22,95,201,296,53,53,28,9,333,2213,272,272,"",null,{"$f":"M922*100/M1315","v":1.345617650624318},23,5,3,61,277,0.88888888888888884,8.408408408408409E-2,2.7027027027027029E-2,{"$f":"L922*100/B$1285","v":318.02120141342755}]
["2020-03-16T17:00:00",15,"Campania",103,22,125,238,363,67,67,28,9,400,2517,272,272,"",null,{"$f":"M923*100/M1316","v":1.4295925661186561},14,"","",67,304,0.90749999999999997,7.0000000000000007E-2,2.2499999999999999E-2,{"$f":"L923*100/B$1285","v":318.02120141342755}]
["2020-03-17T17:00:00",15,"Campania",127,24,151,272,423,60,60,28,9,460,2685,272,272,"",null,{"$f":"M924*100/M1317","v":1.4600393575826827},-7,"","",60,168,0.91956521739130437,6.0869565217391307E-2,1.9565217391304349E-2,{"$f":"L924*100/B$1285","v":318.02120141342755}]
["2020-03-18T17:00:00",15,"Campania",127,24,151,272,423,0,0,28,9,460,2685,272,272,"",null,{"$f":"M925*100/M1318","v":1.2880463696693081},-60,"","","","",0.91956521739130437,6.0869565217391307E-2,1.9565217391304349E-2,{"$f":"L925*100/B$1285","v":318.02120141342755}]
["2020-03-19T17:00:00",15,"Campania",213,36,249,356,605,182,182,30,17,652,3544,652,"x2",652,null,{"$f":"M926*100/M1319","v":1.5888875350310709},182,2,8,192,859,0.92791411042944782,4.6012269938650305E-2,2.6073619631901839E-2,{"$f":"L926*100/B$1285","v":600.70671378091868}]
["2020-03-20T17:00:00",15,"Campania",130,41,171,531,702,97,97,30,17,749,3845,652,652,"",null,{"$f":"M927*100/M1320","v":1.5929052976329725},-85,"","",97,{"$f":"IF(N927-N926=0,\"\",N927-N926)","v":301},0.93724966622162886,4.0053404539385849E-2,2.2696929238985315E-2,{"$f":"L927*100/B$1285","v":600.70671378091868}]
["2020-03-21T17:00:00",15,"Campania",233,87,320,473,793,91,91,29,22,844,4448,652,652,"",null,{"$f":"M928*100/M1321","v":1.5752734331255367},-6,-1,5,{"$f":"IF(M928-M927=0,\"\",M928-M927)","v":95},603,0.93957345971563977,3.4360189573459717E-2,2.6066350710900472E-2,{"$f":"L928*100/B$1285","v":777.38515901060066}]
["2020-03-22T17:00:00",15,"Campania",243,99,342,524,866,73,73,41,29,936,4943,652,652,"",null,{"$f":"M929*100/M1322","v":1.5827386790219486},-18,12,7,92,495,0.92521367521367526,4.38034188034188E-2,3.0982905982905984E-2,{"$f":"L929*100/B$1285","v":1024.7349823321554}]
["2020-03-23T17:00:00",15,"Campania",266,110,376,553,929,63,63,48,49,1026,5813,652,652,"",null,{"$f":"M930*100/M1323","v":1.6049556525411799},-10,7,20,90,870,0.90545808966861596,4.6783625730994149E-2,4.7758284600389861E-2,{"$f":"L930*100/B$1285","v":1731.4487632508833}]
["2020-03-24T17:00:00",15,"Campania",345,181,526,466,992,63,63,53,56,1101,6297,652,652,"",null,{"$f":"M931*100/M1324","v":1.5915924598126518},"",5,7,75,484,0.90099909173478654,4.8138056312443236E-2,5.0862851952770211E-2,{"$f":"L931*100/B$1285","v":1978.7985865724381}]
["2020-03-25T17:00:00",15,"Campania",318,123,441,631,1072,80,80,53,74,1199,6972,652,652,"",null,{"$f":"M932*100/M1325","v":1.6118624472346947},17,"",18,98,675,0.89407839866555461,4.4203502919099247E-2,6.1718098415346125E-2,{"$f":"L932*100/B$1285","v":2614.840989399293}]
["2020-03-26T17:00:00",15,"Campania",448,114,562,607,1169,97,97,58,83,1310,8346,1310,"x2",1310,null,{"$f":"M933*100/M1326","v":1.6265411788077826},17,5,9,111,{"$f":"IF(N933-N932=0,\"\",N933-N932)","v":1374},0.89236641221374047,4.4274809160305344E-2,6.3358778625954196E-2,{"$f":"L933*100/B$1285","v":2932.8621908127207}]
["2020-03-27T17:00:00",15,"Campania",456,113,569,723,1292,123,144,64,98,1454,9613,{"$f":"IF(P934=\"x2\",M934,O933)","v":1310},{"$f":"IF(M934>O933*2,\"x2\",O933)","v":1310},{"$f":"IF(P934=\"x2\",M934,\"\")","v":""},null,{"$f":"M934*100/M1327","v":1.6809637217045481},{"$f":"IF(J934-J933=0,\"\",J934-J933)","v":47},6,15,144,1267,0.88858321870701518,4.4016506189821183E-2,6.7400275103163682E-2,{"$f":"L934*100/B$1285","v":3462.8975265017666}]
["2020-03-28T17:00:00",15,"Campania",463,132,595,812,1407,115,138,76,109,1592,10616,1310,1310,"",null,{"$f":"M935*100/M1328","v":1.7216022147244572},-6,12,11,138,1003,0.88379396984924619,4.7738693467336682E-2,6.846733668341709E-2,{"$f":"L935*100/B$1285","v":3851.5901060070669}]
["2020-03-29T17:00:00",15,"Campania",476,135,611,945,1556,149,167,86,117,1759,11805,1310,1310,"",null,{"$f":"M936*100/M1329","v":1.8006121467104792},29,10,8,167,1189,0.8845935190449119,4.8891415577032402E-2,6.651506537805571E-2,{"$f":"L936*100/B$1285","v":4134.2756183745578}]
["2020-03-30T17:00:00",15,"Campania",468,126,594,1145,1739,183,193,88,125,1952,12969,1310,1310,"",null,{"$f":"M937*100/M1330","v":1.9186349384208612},26,2,8,193,1164,0.89088114754098358,4.5081967213114756E-2,6.4036885245901634E-2,{"$f":"L937*100/B$1285","v":4416.9611307420491}]
["2020-03-31T17:00:00",15,"Campania",501,133,634,1237,1871,132,140,88,133,2092,14403,1310,1310,"",null,{"$f":"M938*100/M1331","v":1.9774652147610405},-53,"",8,140,1434,0.8943594646271511,4.2065009560229447E-2,6.3575525812619507E-2,{"$f":"L938*100/B$1285","v":4699.6466431095405}]
["2020-04-01T17:00:00",15,"Campania",478,129,607,1369,1976,105,139,107,148,2231,15728,1310,1310,"",null,{"$f":"M939*100/M1332","v":2.017653336227323},-1,19,15,139,{"$f":"IF(N939-N938=0,\"\",N939-N938)","v":1325},{"$f":"IF(M939=0,0,H939/M939)","v":0.88570147915732855},{"$f":"IF(M939=0,0,K939/M939)","v":4.7960555804571939E-2},{"$f":"IF(M939=0,0,L939/M939)","v":6.6337965038099508E-2},{"$f":"L939*100/B$1285","v":5229.681978798586}]
["2020-04-02T17:00:00",15,"Campania",503,120,623,1517,2140,164,225,149,167,2456,17404,{"$f":"IF(P940=\"x2\",M940,O939)","v":1310},{"$f":"IF(M940>O939*2,\"x2\",O939)","v":1310},{"$f":"IF(P940=\"x2\",M940,\"\")","v":""},null,{"$f":"M940*100/M1333","v":2.1311674563093317},{"$f":"IF(J940-J939=0,\"\",J940-J939)","v":86},{"$f":"IF(K940-K939=0,\"\",K940-K939)","v":42},{"$f":"IF(L940-L939=0,\"\",L940-L939)","v":19},{"$f":"IF(M940-M939=0,\"\",M940-M939)","v":225},1676,0.87133550488599354,6.0667752442996742E-2,6.7996742671009774E-2,{"$f":"L940*100/B$1285","v":5901.0600706713776}]
["2020-04-03T17:00:00",15,"Campania",532,115,647,1705,2352,212,221,144,181,2677,19237,{"$f":"IF(P941=\"x2\",M941,O940)","v":2677},{"$f":"IF(M941>O940*2,\"x2\",O940)","v":"x2"},{"$f":"IF(P941=\"x2\",M941,\"\")","v":2677},null,{"$f":"M941*100/M1334","v":2.2340540946531249},{"$f":"IF(J941-J940=0,\"\",J941-J940)","v":-4},{"$f":"IF(K941-K940=0,\"\",K941-K940)","v":-5},{"$f":"IF(L941-L940=0,\"\",L941-L940)","v":14},{"$f":"IF(M941-M940=0,\"\",M941-M940)","v":221},1833,0.87859544265969369,5.3791557713858795E-2,6.7612999626447512E-2,{"$f":"L941*100/B$1285","v":6395.7597173144877}]
["2020-04-04T17:00:00",15,"Campania",567,114,681,1815,2496,144,151,146,186,2828,21534,{"$f":"IF(P942=\"x2\",M942,O941)","v":2677},{"$f":"IF(M942>O941*2,\"x2\",O941)","v":2677},{"$f":"IF(P942=\"x2\",M942,\"\")","v":""},null,{"$f":"M942*100/M1335","v":2.2690801720264457},{"$f":"IF(J942-J941=0,\"\",J942-J941)","v":-70},{"$f":"IF(K942-K941=0,\"\",K942-K941)","v":2},{"$f":"IF(L942-L941=0,\"\",L942-L941)","v":5},{"$f":"IF(M942-M941=0,\"\",M942-M941)","v":151},2297,0.88260254596888266,5.1626591230551626E-2,6.5770862800565766E-2,{"$f":"L942*100/B$1285","v":6572.4381625441692}]
["2020-04-05T17:00:00",15,"Campania",609,108,717,1904,2621,125,132,150,189,2960,23139,{"$f":"IF(P943=\"x2\",M943,O942)","v":2677},{"$f":"IF(M943>O942*2,\"x2\",O942)","v":2677},{"$f":"IF(P943=\"x2\",M943,\"\")","v":""},null,{"$f":"M943*100/M1336","v":2.2954989608214165},{"$f":"IF(J943-J942=0,\"\",J943-J942)","v":-19},{"$f":"IF(K943-K942=0,\"\",K943-K942)","v":4},{"$f":"IF(L943-L942=0,\"\",L943-L942)","v":3},{"$f":"IF(M943-M942=0,\"\",M943-M942)","v":132},1605,0.885472972972973,5.0675675675675678E-2,6.3851351351351351E-2,{"$f":"L943*100/B$1285","v":6678.4452296819791}]
["2020-04-06T17:00:00",15,"Campania",610,101,711,1987,2698,77,98,156,204,3058,24526,{"$f":"IF(P944=\"x2\",M944,O943)","v":2677},{"$f":"IF(M944>O943*2,\"x2\",O943)","v":2677},{"$f":"IF(P944=\"x2\",M944,\"\")","v":""},null,{"$f":"M944*100/M1337","v":2.3071061585701678},{"$f":"IF(J944-J943=0,\"\",J944-J943)","v":-34},{"$f":"IF(K944-K943=0,\"\",K944-K943)","v":6},{"$f":"IF(L944-L943=0,\"\",L944-L943)","v":15},{"$f":"IF(M944-M943=0,\"\",M944-M943)","v":98},1387,0.88227599738391105,5.1013734466971876E-2,6.6710268149117069E-2,{"$f":"L944*100/B$1285","v":7208.4805653710246}]
["2020-04-07T17:00:00",15,"Campania",603,103,706,2059,2765,67,90,167,216,3148,25779,{"$f":"IF(P945=\"x2\",M945,O944)","v":2677},{"$f":"IF(M945>O944*2,\"x2\",O944)","v":2677},{"$f":"IF(P945=\"x2\",M945,\"\")","v":""},null,{"$f":"M945*100/M1338","v":2.3217736344460342},{"$f":"IF(J945-J944=0,\"\",J945-J944)","v":-8},{"$f":"IF(K945-K944=0,\"\",K945-K944)","v":11},{"$f":"IF(L945-L944=0,\"\",L945-L944)","v":12},{"$f":"IF(M945-M944=0,\"\",M945-M944)","v":90},{"$f":"IF(N945-N944=0,\"\",N945-N944)","v":1253},{"$f":"IF(M945=0,0,H945/M945)","v":0.87833545108005084},{"$f":"IF(M945=0,0,K945/M945)","v":5.3049555273189324E-2},{"$f":"IF(M945=0,0,L945/M945)","v":6.8614993646759853E-2},{"$f":"L945*100/B$1285","v":7632.5088339222611}]
["2020-04-08T17:00:00",15,"Campania",608,97,705,2154,2859,94,120,188,221,3268,27784,{"$f":"IF(P946=\"x2\",M946,O945)","v":2677},{"$f":"IF(M946>O945*2,\"x2\",O945)","v":2677},{"$f":"IF(P946=\"x2\",M946,\"\")","v":""},null,{"$f":"M946*100/M1339","v":2.343962932679204},{"$f":"IF(J946-J945=0,\"\",J946-J945)","v":30},{"$f":"IF(K946-K945=0,\"\",K946-K945)","v":21},{"$f":"IF(L946-L945=0,\"\",L946-L945)","v":5},{"$f":"IF(M946-M945=0,\"\",M946-M945)","v":120},{"$f":"IF(N946-N945=0,\"\",N946-N945)","v":2005},{"$f":"IF(M946=0,0,H946/M946)","v":0.87484700122399017},{"$f":"IF(M946=0,0,K946/M946)","v":5.7527539779681759E-2},{"$f":"IF(M946=0,0,L946/M946)","v":6.7625458996328033E-2},{"$f":"L946*100/B$1285","v":7809.1872791519436}]
["2020-04-09T17:00:00",15,"Campania",604,94,698,2175,2873,14,76,244,227,3344,29664,{"$f":"IF(P947=\"x2\",M947,O946)","v":2677},{"$f":"IF(M947>O946*2,\"x2\",O946)","v":2677},{"$f":"IF(P947=\"x2\",M947,\"\")","v":""},null,{"$f":"M947*100/M1340","v":2.3282692548702881},{"$f":"IF(J947-J946=0,\"\",J947-J946)","v":-44},{"$f":"IF(K947-K946=0,\"\",K947-K946)","v":56},{"$f":"IF(L947-L946=0,\"\",L947-L946)","v":6},{"$f":"IF(M947-M946=0,\"\",M947-M946)","v":76},{"$f":"IF(N947-N946=0,\"\",N947-N946)","v":1880},{"$f":"IF(M947=0,0,H947/M947)","v":0.85915071770334928},{"$f":"IF(M947=0,0,K947/M947)","v":7.2966507177033499E-2},{"$f":"IF(M947=0,0,L947/M947)","v":6.7882775119617225E-2},{"$f":"L947*100/B$1285","v":8021.2014134275614}]
["2020-04-10T17:00:00",15,"Campania",600,90,690,2273,2963,90,98,248,231,3442,31745,{"$f":"IF(P948=\"x2\",M948,O947)","v":2677},{"$f":"IF(M948>O947*2,\"x2\",O947)","v":2677},{"$f":"IF(P948=\"x2\",M948,\"\")","v":""},null,{"$f":"M948*100/M1341","v":2.3323417605724468},{"$f":"IF(J948-J947=0,\"\",J948-J947)","v":22},{"$f":"IF(K948-K947=0,\"\",K948-K947)","v":4},{"$f":"IF(L948-L947=0,\"\",L948-L947)","v":4},{"$f":"IF(M948-M947=0,\"\",M948-M947)","v":98},{"$f":"IF(N948-N947=0,\"\",N948-N947)","v":2081},{"$f":"IF(M948=0,0,H948/M948)","v":0.86083672283556067},{"$f":"IF(M948=0,0,K948/M948)","v":7.2051133062173159E-2},{"$f":"IF(M948=0,0,L948/M948)","v":6.7112144102266125E-2},{"$f":"L948*100/B$1285","v":8162.5441696113076}]
["2020-04-11T17:00:00",15,"Campania",582,85,667,2335,3002,39,75,277,238,3517,33781,{"$f":"IF(P949=\"x2\",M949,O948)","v":2677},{"$f":"IF(M949>O948*2,\"x2\",O948)","v":2677},{"$f":"IF(P949=\"x2\",M949,\"\")","v":""},null,{"$f":"M949*100/M1342","v":2.309697841348648},{"$f":"IF(J949-J948=0,\"\",J949-J948)","v":-23},{"$f":"IF(K949-K948=0,\"\",K949-K948)","v":29},{"$f":"IF(L949-L948=0,\"\",L949-L948)","v":7},{"$f":"IF(M949-M948=0,\"\",M949-M948)","v":75},{"$f":"IF(N949-N948=0,\"\",N949-N948)","v":2036},{"$f":"IF(M949=0,0,H949/M949)","v":0.85356838214387265},{"$f":"IF(M949=0,0,K949/M949)","v":7.8760307079897646E-2},{"$f":"IF(M949=0,0,L949/M949)","v":6.7671310776229746E-2},{"$f":"L949*100/B$1285","v":8409.8939929328626}]
["2020-04-12T17:00:00",15,"Campania",526,82,608,2449,3057,55,87,305,242,3604,35448,{"$f":"IF(P950=\"x2\",M950,O949)","v":2677},{"$f":"IF(M950>O949*2,\"x2\",O949)","v":2677},{"$f":"IF(P950=\"x2\",M950,\"\")","v":""},null,{"$f":"M950*100/M1343","v":2.3048931013091334},{"$f":"IF(J950-J949=0,\"\",J950-J949)","v":12},{"$f":"IF(K950-K949=0,\"\",K950-K949)","v":28},{"$f":"IF(L950-L949=0,\"\",L950-L949)","v":4},{"$f":"IF(M950-M949=0,\"\",M950-M949)","v":87},{"$f":"IF(N950-N949=0,\"\",N950-N949)","v":1667},{"$f":"IF(M950=0,0,H950/M950)","v":0.84822419533851279},{"$f":"IF(M950=0,0,K950/M950)","v":8.4628190899001116E-2},{"$f":"IF(M950=0,0,L950/M950)","v":6.7147613762486125E-2},{"$f":"L950*100/B$1285","v":8551.2367491166078}]
["2020-04-13T17:00:00",15,"Campania",606,80,686,2376,3062,5,66,360,248,3670,36770,{"$f":"IF(P951=\"x2\",M951,O950)","v":2677},{"$f":"IF(M951>O950*2,\"x2\",O950)","v":2677},{"$f":"IF(P951=\"x2\",M951,\"\")","v":""},null,{"$f":"M951*100/M1344","v":2.3007096466812107},{"$f":"IF(J951-J950=0,\"\",J951-J950)","v":-21},{"$f":"IF(K951-K950=0,\"\",K951-K950)","v":55},{"$f":"IF(L951-L950=0,\"\",L951-L950)","v":6},{"$f":"IF(M951-M950=0,\"\",M951-M950)","v":66},{"$f":"IF(N951-N950=0,\"\",N951-N950)","v":1322},{"$f":"IF(M951=0,0,H951/M951)","v":0.83433242506811989},{"$f":"IF(M951=0,0,K951/M951)","v":9.8092643051771122E-2},{"$f":"IF(M951=0,0,L951/M951)","v":6.757493188010899E-2},{"$f":"L951*100/B$1285","v":8763.2508833922257}]
["2020-04-14T17:00:00",15,"Campania",618,82,700,2394,3094,32,99,415,260,3769,38094,{"$f":"IF(P952=\"x2\",M952,O951)","v":2677},{"$f":"IF(M952>O951*2,\"x2\",O951)","v":2677},{"$f":"IF(P952=\"x2\",M952,\"\")","v":""},null,{"$f":"M952*100/M1345","v":2.31955590566688},{"$f":"IF(J952-J951=0,\"\",J952-J951)","v":33},{"$f":"IF(K952-K951=0,\"\",K952-K951)","v":55},{"$f":"IF(L952-L951=0,\"\",L952-L951)","v":12},{"$f":"IF(M952-M951=0,\"\",M952-M951)","v":99},{"$f":"IF(N952-N951=0,\"\",N952-N951)","v":1324},{"$f":"IF(M952=0,0,H952/M952)","v":0.82090740249403027},{"$f":"IF(M952=0,0,K952/M952)","v":0.11010878217033696},{"$f":"IF(M952=0,0,L952/M952)","v":6.8983815335632789E-2},{"$f":"L952*100/B$1285","v":9187.2791519434631}]
["2020-04-15T17:00:00",15,"Campania",607,86,693,2394,3087,-7,38,442,278,3807,39534,{"$f":"IF(P953=\"x2\",M953,O952)","v":2677},{"$f":"IF(M953>O952*2,\"x2\",O952)","v":2677},{"$f":"IF(P953=\"x2\",M953,\"\")","v":""},null,{"$f":"M953*100/M1346","v":2.3051073234234507},{"$f":"IF(J953-J952=0,\"\",J953-J952)","v":-61},{"$f":"IF(K953-K952=0,\"\",K953-K952)","v":27},{"$f":"IF(L953-L952=0,\"\",L953-L952)","v":18},{"$f":"IF(M953-M952=0,\"\",M953-M952)","v":38},{"$f":"IF(N953-N952=0,\"\",N953-N952)","v":1440},{"$f":"IF(M953=0,0,H953/M953)","v":0.81087470449172572},{"$f":"IF(M953=0,0,K953/M953)","v":0.11610191752035724},{"$f":"IF(M953=0,0,L953/M953)","v":7.3023377987916999E-2},{"$f":"L953*100/B$1285","v":9823.3215547703185}]
[{"$f":"A953 + 1","v":"2020-04-16T17:00:00"},null,null,null,null,null,null,null,null,null,null,null,null,null,null,"Media x2",{"$f":"COUNT(M902:M953) / COUNT(Q902:Q953)","v":5.2}]
[{"$f":"A954+1","v":"2020-04-17T17:00:00"}]
[{"$f":"A955+1","v":"2020-04-18T17:00:00"}]
[null,null,null,null,{"$f":"E953/$M953","v":2.25899658523772E-2},null,null,{"$f":"H953/$M953","v":0.81087470449172572},null,null,{"$f":"K953/$M953","v":0.11610191752035724},{"$f":"L953/$M953","v":7.3023377987916999E-2},null,{"$f":"N953/$M953","v":10.384554767533491}]
[]
[]
[]
["Data","Codice","Regione","Ricoverati","Terap. Intens.","Ospedalizzati","Quarantena","Positivi","+ Positivi","Nuovi","Guariti","Deceduti","Totale","Tamponi",null,null,"x 2",null,"% su Tot.","+ Nuovi","+ Guariti","+ Deceduti","+ Totali","+ Tamponi","% Positivi","% Guariti","% Deceduti","P. Stimati"]
["2020-02-24T18:00:00",16,"Puglia",0,0,0,0,0,0,0,0,0,0,0,{"$f":"M962","v":0},null,{"$f":"M962","v":0},null,{"$f":"M962*100/M1295","v":0},null,null,null,null,null,{"$f":"IF(M962=0,0,H962/M962)","v":0},{"$f":"IF(M962=0,0,K962/M962)","v":0},{"$f":"IF(M962=0,0,L962/M962)","v":0},{"$f":"L962*100/B$1285","v":0}]
["2020-02-25T18:00:00",16,"Puglia",0,0,0,0,0,0,0,0,0,0,0,{"$f":"IF(P963=\"x2\",M963,O962)","v":0},{"$f":"IF(M963>O962*2,\"x2\",O962)","v":0},{"$f":"IF(P963=\"x2\",M963,\"\")","v":""},null,{"$f":"M963*100/M1296","v":0},{"$f":"IF(J963-J962=0,\"\",J963-J962)","v":""},{"$f":"IF(K963-K962=0,\"\",K963-K962)","v":""},{"$f":"IF(L963-L962=0,\"\",L963-L962)","v":""},{"$f":"IF(M963-M962=0,\"\",M963-M962)","v":""},{"$f":"IF(N963-N962=0,\"\",N963-N962)","v":""},0,0,0,{"$f":"L963*100/B$1285","v":0}]
["2020-02-26T18:00:00",16,"Puglia",0,0,0,0,0,0,0,0,0,0,0,0,0,"",null,{"$f":"M964*100/M1297","v":0},"","","","","",0,0,0,{"$f":"L964*100/B$1285","v":0}]
["2020-02-27T18:00:00",16,"Puglia",1,0,1,0,1,1,1,0,0,1,0,1,"x2",1,null,{"$f":"M965*100/M1298","v":0.15384615384615385},1,"","",1,"",1,0,0,{"$f":"L965*100/B$1285","v":0}]
["2020-02-28T18:00:00",16,"Puglia",1,0,1,2,3,2,2,0,0,3,242,3,"x2",3,null,{"$f":"M966*100/M1299","v":0.33783783783783783},1,"","",2,242,1,0,0,{"$f":"L966*100/B$1285","v":0}]
["2020-02-29T17:00:00",16,"Puglia",1,0,1,2,3,0,0,0,0,3,252,3,3,"",null,{"$f":"M967*100/M1300","v":0.26595744680851063},-2,"","","",10,1,0,0,{"$f":"L967*100/B$1285","v":0}]
["2020-03-01T17:00:00",16,"Puglia",1,0,1,2,3,0,0,0,0,3,262,3,3,"",null,{"$f":"M968*100/M1301","v":0.17709563164108619},"","","","",10,1,0,0,{"$f":"L968*100/B$1285","v":0}]
["2020-03-02T18:00:00",16,"Puglia",2,0,2,2,4,1,1,0,0,4,278,3,3,"",null,{"$f":"M969*100/M1302","v":0.19646365422396855},1,"","",1,16,1,0,0,{"$f":"L969*100/B$1285","v":0}]
["2020-03-03T18:00:00",16,"Puglia",2,0,2,4,6,2,2,0,0,6,298,3,3,"",null,{"$f":"M970*100/M1303","v":0.23980815347721823},1,"","",2,20,1,0,0,{"$f":"L970*100/B$1285","v":0}]
["2020-03-04T17:00:00",16,"Puglia",4,0,4,3,7,1,1,1,1,9,322,9,"x2",9,null,{"$f":"M971*100/M1304","v":0.29135642602784073},-1,1,1,3,24,0.77777777777777779,0.1111111111111111,0.1111111111111111,{"$f":"L971*100/B$1285","v":35.335689045936398}]
["2020-03-05T17:00:00",16,"Puglia",5,1,6,6,12,5,5,1,1,14,359,9,9,"",null,{"$f":"M972*100/M1305","v":0.36288232244686364},4,"","",5,37,0.8571428571428571,7.1428571428571425E-2,7.1428571428571425E-2,{"$f":"L972*100/B$1285","v":35.335689045936398}]
["2020-03-06T17:00:00",16,"Puglia",5,1,6,9,15,3,3,1,1,17,395,9,9,"",null,{"$f":"M973*100/M1306","v":0.36669542709232095},-2,"","",3,36,0.88235294117647056,5.8823529411764705E-2,5.8823529411764705E-2,{"$f":"L973*100/B$1285","v":35.335689045936398}]
["2020-03-07T18:00:00",16,"Puglia",9,2,11,12,23,8,8,1,2,26,395,26,"x2",26,null,{"$f":"M974*100/M1307","v":0.44195138534761175},5,"",1,9,"",0.88461538461538458,3.8461538461538464E-2,7.6923076923076927E-2,{"$f":"L974*100/B$1285","v":70.671378091872796}]
["2020-03-08T18:00:00",16,"Puglia",17,3,20,16,36,13,13,1,3,40,627,26,26,"",null,{"$f":"M975*100/M1308","v":0.5423728813559322},5,"",1,14,232,0.9,2.5000000000000001E-2,7.4999999999999997E-2,{"$f":"L975*100/B$1285","v":106.00706713780919}]
["2020-03-09T18:00:00",16,"Puglia",20,6,26,20,46,10,10,1,3,50,685,26,26,"",null,{"$f":"M976*100/M1309","v":0.54513737461840384},-3,"","",10,58,0.92,0.02,0.06,{"$f":"L976*100/B$1285","v":106.00706713780919}]
["2020-03-10T18:00:00",16,"Puglia",28,6,34,21,55,9,9,1,3,59,747,59,"x2",59,null,{"$f":"M977*100/M1310","v":0.58133806286333634},-1,"","",9,62,0.93220338983050843,1.6949152542372881E-2,5.0847457627118647E-2,{"$f":"L977*100/B$1285","v":106.00706713780919}]
["2020-03-11T17:00:00",16,"Puglia",38,4,42,29,71,16,16,1,5,77,909,59,59,"",null,{"$f":"M978*100/M1311","v":0.61787835018456105},7,"",2,18,162,0.92207792207792205,1.2987012987012988E-2,6.4935064935064929E-2,{"$f":"L978*100/B$1285","v":176.67844522968198}]
["2020-03-12T17:00:00",16,"Puglia",58,2,60,38,98,27,27,1,5,104,1269,59,59,"",null,{"$f":"M979*100/M1312","v":0.6881492754582148},11,"","",27,360,0.94230769230769229,9.6153846153846159E-3,4.807692307692308E-2,{"$f":"L979*100/B$1285","v":176.67844522968198}]
["2020-03-13T17:00:00",16,"Puglia",77,2,79,42,121,23,23,3,5,129,1449,129,"x2",129,null,{"$f":"M980*100/M1313","v":0.73046432616081536},-4,2,"",25,180,0.93798449612403101,2.3255813953488372E-2,3.875968992248062E-2,{"$f":"L980*100/B$1285","v":176.67844522968198}]
["2020-03-14T17:00:00",16,"Puglia",91,6,97,59,156,35,35,2,8,166,1681,129,129,"",null,{"$f":"M981*100/M1314","v":0.78461029446518882},12,-1,3,37,232,0.93975903614457834,1.2048192771084338E-2,4.8192771084337352E-2,{"$f":"L981*100/B$1285","v":282.68551236749119}]
["2020-03-15T17:00:00",16,"Puglia",116,6,122,90,212,56,56,2,16,230,2017,129,129,"",null,{"$f":"M982*100/M1315","v":0.92940558451529476},21,"",8,64,336,0.92173913043478262,8.6956521739130436E-3,6.9565217391304349E-2,{"$f":"L982*100/B$1285","v":565.37102473498237}]
["2020-03-16T17:00:00",16,"Puglia",116,6,122,90,212,0,0,2,16,230,2017,129,129,"",null,{"$f":"M983*100/M1316","v":0.82201572551822732},-56,"","","","",0.92173913043478262,8.6956521739130436E-3,6.9565217391304349E-2,{"$f":"L983*100/B$1285","v":565.37102473498237}]
["2020-03-17T17:00:00",16,"Puglia",155,14,169,151,320,108,108,2,18,340,3077,340,"x2",340,null,{"$f":"M984*100/M1317","v":1.079159525169809},108,"",2,110,1060,0.94117647058823528,5.8823529411764705E-3,5.2941176470588235E-2,{"$f":"L984*100/B$1285","v":636.0424028268551}]
["2020-03-18T17:00:00",16,"Puglia",156,30,186,176,362,42,42,2,19,383,3433,340,340,"",null,{"$f":"M985*100/M1318","v":1.0724386077898804},-66,"",1,43,356,0.94516971279373363,5.2219321148825066E-3,4.960835509138381E-2,{"$f":"L985*100/B$1285","v":671.37809187279152}]
["2020-03-19T17:00:00",16,"Puglia",173,31,204,245,449,87,87,4,25,478,4046,340,340,"",null,{"$f":"M986*100/M1319","v":1.1648592664798343},45,2,6,95,613,0.93933054393305437,8.368200836820083E-3,5.2301255230125521E-2,{"$f":"L986*100/B$1285","v":883.39222614840992}]
["2020-03-20T17:00:00",16,"Puglia",191,31,222,329,551,102,102,4,26,581,4789,340,340,"",null,{"$f":"M987*100/M1320","v":1.2356181280704366},15,"",1,103,{"$f":"IF(N987-N986=0,\"\",N987-N986)","v":743},0.94836488812392428,6.8846815834767644E-3,4.4750430292598967E-2,{"$f":"L987*100/B$1285","v":918.72791519434622}]
["2020-03-21T17:00:00",16,"Puglia",209,33,242,400,642,91,91,4,29,675,5617,340,340,"",null,{"$f":"M988*100/M1321","v":1.2598454589570347},-11,"",3,{"$f":"IF(M988-M987=0,\"\",M988-M987)","v":94},828,0.95111111111111113,5.9259259259259256E-3,4.296296296296296E-2,{"$f":"L988*100/B$1285","v":1024.7349823321554}]
["2020-03-22T17:00:00",16,"Puglia",252,37,289,459,748,106,106,7,31,786,6160,786,"x2",786,null,{"$f":"M989*100/M1322","v":1.3290946599479185},15,3,2,111,543,0.95165394402035619,8.9058524173027988E-3,3.9440203562340966E-2,{"$f":"L989*100/B$1285","v":1095.4063604240282}]
["2020-03-23T17:00:00",16,"Puglia",285,45,330,532,862,114,114,7,37,906,6761,786,786,"",null,{"$f":"M990*100/M1323","v":1.4172415411328547},8,"",6,120,601,0.95143487858719644,7.7262693156732896E-3,4.0838852097130243E-2,{"$f":"L990*100/B$1285","v":1307.4204946996465}]
["2020-03-24T17:00:00",16,"Puglia",317,57,374,566,940,78,78,21,44,1005,7345,786,786,"",null,{"$f":"M991*100/M1324","v":1.4528160055510582},-36,14,7,99,584,0.93532338308457708,2.0895522388059702E-2,4.3781094527363187E-2,{"$f":"L991*100/B$1285","v":1554.7703180212013}]
["2020-03-25T17:00:00",16,"Puglia",349,64,413,610,1023,83,83,22,48,1093,8223,786,786,"",null,{"$f":"M992*100/M1325","v":1.4693625144516442},5,1,4,88,878,0.93595608417200371,2.0128087831655993E-2,4.3915827996340348E-2,{"$f":"L992*100/B$1285","v":1696.113074204947}]
["2020-03-26T17:00:00",16,"Puglia",480,76,556,539,1095,72,72,22,65,1182,9191,786,786,"",null,{"$f":"M993*100/M1326","v":1.4676119643899228},-11,"",17,89,{"$f":"IF(N993-N992=0,\"\",N993-N992)","v":968},0.92639593908629436,1.8612521150592216E-2,5.499153976311337E-2,{"$f":"L993*100/B$1285","v":2296.8197879858658}]
["2020-03-27T17:00:00",16,"Puglia",530,82,612,624,1236,141,152,29,69,1334,10233,{"$f":"IF(P994=\"x2\",M994,O993)","v":786},{"$f":"IF(M994>O993*2,\"x2\",O993)","v":786},{"$f":"IF(P994=\"x2\",M994,\"\")","v":""},null,{"$f":"M994*100/M1327","v":1.542232190339661},{"$f":"IF(J994-J993=0,\"\",J994-J993)","v":80},7,4,152,1042,0.92653673163418293,2.1739130434782608E-2,5.1724137931034482E-2,{"$f":"L994*100/B$1285","v":2438.1625441696115}]
["2020-03-28T17:00:00",16,"Puglia",563,98,661,697,1358,122,124,29,71,1458,11500,786,786,"",null,{"$f":"M995*100/M1328","v":1.5766934855956398},-28,"",2,124,1267,0.93141289437585739,1.9890260631001373E-2,4.8696844993141288E-2,{"$f":"L995*100/B$1285","v":2508.8339222614841}]
["2020-03-29T17:00:00",16,"Puglia",559,99,658,774,1432,74,91,31,86,1549,12361,786,786,"",null,{"$f":"M996*100/M1329","v":1.5856442383482274},-33,2,15,91,861,0.92446739832149771,2.0012911555842477E-2,5.5519690122659782E-2,{"$f":"L996*100/B$1285","v":3038.86925795053}]
["2020-03-30T17:00:00",16,"Puglia",590,106,696,889,1585,153,163,36,91,1712,13117,1712,"x2",1712,null,{"$f":"M997*100/M1330","v":1.6827372000904275},72,5,5,163,756,0.92581775700934577,2.1028037383177569E-2,5.3154205607476634E-2,{"$f":"L997*100/B$1285","v":3215.547703180212}]
["2020-03-31T17:00:00",16,"Puglia",609,105,714,940,1654,69,91,39,110,1803,14073,1712,1712,"",null,{"$f":"M998*100/M1331","v":1.7042876588021778},-72,3,19,91,956,0.91735995562950634,2.1630615640599003E-2,6.1009428729894621E-2,{"$f":"L998*100/B$1285","v":3886.9257950530036}]
["2020-04-01T17:00:00",16,"Puglia",637,107,744,1012,1756,102,143,61,129,1946,15209,1712,1712,"",null,{"$f":"M999*100/M1332","v":1.7599073923345452},52,22,19,143,{"$f":"IF(N999-N998=0,\"\",N999-N998)","v":1136},{"$f":"IF(M999=0,0,H999/M999)","v":0.9023638232271326},{"$f":"IF(M999=0,0,K999/M999)","v":3.1346351490236381E-2},{"$f":"IF(M999=0,0,L999/M999)","v":6.628982528263104E-2},{"$f":"L999*100/B$1285","v":4558.3038869257953}]
["2020-04-02T17:00:00",16,"Puglia",645,118,763,1101,1864,108,131,69,144,2077,16554,{"$f":"IF(P1000=\"x2\",M1000,O999)","v":1712},{"$f":"IF(M1000>O999*2,\"x2\",O999)","v":1712},{"$f":"IF(P1000=\"x2\",M1000,\"\")","v":""},null,{"$f":"M1000*100/M1333","v":1.8022943024244633},{"$f":"IF(J1000-J999=0,\"\",J1000-J999)","v":-12},{"$f":"IF(K1000-K999=0,\"\",K1000-K999)","v":8},{"$f":"IF(L1000-L999=0,\"\",L1000-L999)","v":15},{"$f":"IF(M1000-M999=0,\"\",M1000-M999)","v":131},1345,0.89744824265767931,3.3220991815117958E-2,6.9330765527202701E-2,{"$f":"L1000*100/B$1285","v":5088.3392226148408}]
["2020-04-03T17:00:00",16,"Puglia",648,123,771,1178,1949,85,105,69,164,2182,17924,{"$f":"IF(P1001=\"x2\",M1001,O1000)","v":1712},{"$f":"IF(M1001>O1000*2,\"x2\",O1000)","v":1712},{"$f":"IF(P1001=\"x2\",M1001,\"\")","v":""},null,{"$f":"M1001*100/M1334","v":1.8209585485741944},{"$f":"IF(J1001-J1000=0,\"\",J1001-J1000)","v":-26},{"$f":"IF(K1001-K1000=0,\"\",K1001-K1000)","v":""},{"$f":"IF(L1001-L1000=0,\"\",L1001-L1000)","v":20},{"$f":"IF(M1001-M1000=0,\"\",M1001-M1000)","v":105},1370,0.89321723189734192,3.1622364802933088E-2,7.5160403299725023E-2,{"$f":"L1001*100/B$1285","v":5795.0530035335687}]
["2020-04-04T17:00:00",16,"Puglia",627,153,780,1193,1973,24,58,94,173,2240,18977,{"$f":"IF(P1002=\"x2\",M1002,O1001)","v":1712},{"$f":"IF(M1002>O1001*2,\"x2\",O1001)","v":1712},{"$f":"IF(P1002=\"x2\",M1002,\"\")","v":""},null,{"$f":"M1002*100/M1335","v":1.7972912253674818},{"$f":"IF(J1002-J1001=0,\"\",J1002-J1001)","v":-47},{"$f":"IF(K1002-K1001=0,\"\",K1002-K1001)","v":25},{"$f":"IF(L1002-L1001=0,\"\",L1002-L1001)","v":9},{"$f":"IF(M1002-M1001=0,\"\",M1002-M1001)","v":58},1053,0.88080357142857146,4.1964285714285711E-2,7.723214285714286E-2,{"$f":"L1002*100/B$1285","v":6113.0742049469964}]
["2020-04-05T17:00:00",16,"Puglia",574,159,733,1289,2022,49,77,113,182,2317,20080,{"$f":"IF(P1003=\"x2\",M1003,O1002)","v":1712},{"$f":"IF(M1003>O1002*2,\"x2\",O1002)","v":1712},{"$f":"IF(P1003=\"x2\",M1003,\"\")","v":""},null,{"$f":"M1003*100/M1336","v":1.7968483419673047},{"$f":"IF(J1003-J1002=0,\"\",J1003-J1002)","v":19},{"$f":"IF(K1003-K1002=0,\"\",K1003-K1002)","v":19},{"$f":"IF(L1003-L1002=0,\"\",L1003-L1002)","v":9},{"$f":"IF(M1003-M1002=0,\"\",M1003-M1002)","v":77},1103,0.8726801899007337,4.8769961156668103E-2,7.8549848942598186E-2,{"$f":"L1003*100/B$1285","v":6431.095406360424}]
["2020-04-06T17:00:00",16,"Puglia",625,97,722,1393,2115,93,127,134,195,2444,22059,{"$f":"IF(P1004=\"x2\",M1004,O1003)","v":1712},{"$f":"IF(M1004>O1003*2,\"x2\",O1003)","v":1712},{"$f":"IF(P1004=\"x2\",M1004,\"\")","v":""},null,{"$f":"M1004*100/M1337","v":1.8438742483798201},{"$f":"IF(J1004-J1003=0,\"\",J1004-J1003)","v":50},{"$f":"IF(K1004-K1003=0,\"\",K1004-K1003)","v":21},{"$f":"IF(L1004-L1003=0,\"\",L1004-L1003)","v":13},{"$f":"IF(M1004-M1003=0,\"\",M1004-M1003)","v":127},1979,0.86538461538461542,5.4828150572831427E-2,7.9787234042553196E-2,{"$f":"L1004*100/B$1285","v":6890.4593639575969}]
["2020-04-07T17:00:00",16,"Puglia",615,93,708,1429,2137,22,70,168,209,2514,23149,{"$f":"IF(P1005=\"x2\",M1005,O1004)","v":1712},{"$f":"IF(M1005>O1004*2,\"x2\",O1004)","v":1712},{"$f":"IF(P1005=\"x2\",M1005,\"\")","v":""},null,{"$f":"M1005*100/M1338","v":1.8541737347513756},{"$f":"IF(J1005-J1004=0,\"\",J1005-J1004)","v":-57},{"$f":"IF(K1005-K1004=0,\"\",K1005-K1004)","v":34},{"$f":"IF(L1005-L1004=0,\"\",L1005-L1004)","v":14},{"$f":"IF(M1005-M1004=0,\"\",M1005-M1004)","v":70},{"$f":"IF(N1005-N1004=0,\"\",N1005-N1004)","v":1090},{"$f":"IF(M1005=0,0,H1005/M1005)","v":0.85003977724741453},{"$f":"IF(M1005=0,0,K1005/M1005)","v":6.6825775656324582E-2},{"$f":"IF(M1005=0,0,L1005/M1005)","v":8.3134447096260944E-2},{"$f":"L1005*100/B$1285","v":7385.1590106007061}]
["2020-04-08T17:00:00",16,"Puglia",639,90,729,1509,2238,101,120,177,219,2634,24493,{"$f":"IF(P1006=\"x2\",M1006,O1005)","v":1712},{"$f":"IF(M1006>O1005*2,\"x2\",O1005)","v":1712},{"$f":"IF(P1006=\"x2\",M1006,\"\")","v":""},null,{"$f":"M1006*100/M1339","v":1.8892283857640833},{"$f":"IF(J1006-J1005=0,\"\",J1006-J1005)","v":50},{"$f":"IF(K1006-K1005=0,\"\",K1006-K1005)","v":9},{"$f":"IF(L1006-L1005=0,\"\",L1006-L1005)","v":10},{"$f":"IF(M1006-M1005=0,\"\",M1006-M1005)","v":120},{"$f":"IF(N1006-N1005=0,\"\",N1006-N1005)","v":1344},{"$f":"IF(M1006=0,0,H1006/M1006)","v":0.84965831435079731},{"$f":"IF(M1006=0,0,K1006/M1006)","v":6.7198177676537588E-2},{"$f":"IF(M1006=0,0,L1006/M1006)","v":8.3143507972665148E-2},{"$f":"L1006*100/B$1285","v":7738.5159010600701}]
["2020-04-09T17:00:00",16,"Puglia",630,86,716,1585,2301,63,82,190,225,2716,26088,{"$f":"IF(P1007=\"x2\",M1007,O1006)","v":1712},{"$f":"IF(M1007>O1006*2,\"x2\",O1006)","v":1712},{"$f":"IF(P1007=\"x2\",M1007,\"\")","v":""},null,{"$f":"M1007*100/M1340","v":1.8910225168145043},{"$f":"IF(J1007-J1006=0,\"\",J1007-J1006)","v":-38},{"$f":"IF(K1007-K1006=0,\"\",K1007-K1006)","v":13},{"$f":"IF(L1007-L1006=0,\"\",L1007-L1006)","v":6},{"$f":"IF(M1007-M1006=0,\"\",M1007-M1006)","v":82},{"$f":"IF(N1007-N1006=0,\"\",N1007-N1006)","v":1595},{"$f":"IF(M1007=0,0,H1007/M1007)","v":0.84720176730486008},{"$f":"IF(M1007=0,0,K1007/M1007)","v":6.9955817378497792E-2},{"$f":"IF(M1007=0,0,L1007/M1007)","v":8.2842415316642118E-2},{"$f":"L1007*100/B$1285","v":7950.5300353356888}]
["2020-04-10T17:00:00",16,"Puglia",631,80,711,1625,2336,35,93,235,238,2809,27812,{"$f":"IF(P1008=\"x2\",M1008,O1007)","v":1712},{"$f":"IF(M1008>O1007*2,\"x2\",O1007)","v":1712},{"$f":"IF(P1008=\"x2\",M1008,\"\")","v":""},null,{"$f":"M1008*100/M1341","v":1.9034131334828599},{"$f":"IF(J1008-J1007=0,\"\",J1008-J1007)","v":11},{"$f":"IF(K1008-K1007=0,\"\",K1008-K1007)","v":45},{"$f":"IF(L1008-L1007=0,\"\",L1008-L1007)","v":13},{"$f":"IF(M1008-M1007=0,\"\",M1008-M1007)","v":93},{"$f":"IF(N1008-N1007=0,\"\",N1008-N1007)","v":1724},{"$f":"IF(M1008=0,0,H1008/M1008)","v":0.83161267354930579},{"$f":"IF(M1008=0,0,K1008/M1008)","v":8.365966536133855E-2},{"$f":"IF(M1008=0,0,L1008/M1008)","v":8.4727661089355644E-2},{"$f":"L1008*100/B$1285","v":8409.8939929328626}]
["2020-04-11T17:00:00",16,"Puglia",627,73,700,1702,2402,66,95,249,253,2904,29463,{"$f":"IF(P1009=\"x2\",M1009,O1008)","v":1712},{"$f":"IF(M1009>O1008*2,\"x2\",O1008)","v":1712},{"$f":"IF(P1009=\"x2\",M1009,\"\")","v":""},null,{"$f":"M1009*100/M1342","v":1.9071261106842405},{"$f":"IF(J1009-J1008=0,\"\",J1009-J1008)","v":2},{"$f":"IF(K1009-K1008=0,\"\",K1009-K1008)","v":14},{"$f":"IF(L1009-L1008=0,\"\",L1009-L1008)","v":15},{"$f":"IF(M1009-M1008=0,\"\",M1009-M1008)","v":95},{"$f":"IF(N1009-N1008=0,\"\",N1009-N1008)","v":1651},{"$f":"IF(M1009=0,0,H1009/M1009)","v":0.82713498622589532},{"$f":"IF(M1009=0,0,K1009/M1009)","v":8.5743801652892568E-2},{"$f":"IF(M1009=0,0,L1009/M1009)","v":8.7121212121212127E-2},{"$f":"L1009*100/B$1285","v":8939.9293286219072}]
["2020-04-12T17:00:00",16,"Puglia",609,71,680,1772,2452,50,85,277,260,2989,30973,{"$f":"IF(P1010=\"x2\",M1010,O1009)","v":1712},{"$f":"IF(M1010>O1009*2,\"x2\",O1009)","v":1712},{"$f":"IF(P1010=\"x2\",M1010,\"\")","v":""},null,{"$f":"M1010*100/M1343","v":1.9115775471179244},{"$f":"IF(J1010-J1009=0,\"\",J1010-J1009)","v":-10},{"$f":"IF(K1010-K1009=0,\"\",K1010-K1009)","v":28},{"$f":"IF(L1010-L1009=0,\"\",L1010-L1009)","v":7},{"$f":"IF(M1010-M1009=0,\"\",M1010-M1009)","v":85},{"$f":"IF(N1010-N1009=0,\"\",N1010-N1009)","v":1510},{"$f":"IF(M1010=0,0,H1010/M1010)","v":0.82034125125460022},{"$f":"IF(M1010=0,0,K1010/M1010)","v":9.2673134827701578E-2},{"$f":"IF(M1010=0,0,L1010/M1010)","v":8.6985613917698226E-2},{"$f":"L1010*100/B$1285","v":9187.2791519434631}]
["2020-04-13T17:00:00",16,"Puglia",600,71,671,1841,2512,60,76,286,267,3065,31922,{"$f":"IF(P1011=\"x2\",M1011,O1010)","v":1712},{"$f":"IF(M1011>O1010*2,\"x2\",O1010)","v":1712},{"$f":"IF(P1011=\"x2\",M1011,\"\")","v":""},null,{"$f":"M1011*100/M1344","v":1.9214373479776323},{"$f":"IF(J1011-J1010=0,\"\",J1011-J1010)","v":-9},{"$f":"IF(K1011-K1010=0,\"\",K1011-K1010)","v":9},{"$f":"IF(L1011-L1010=0,\"\",L1011-L1010)","v":7},{"$f":"IF(M1011-M1010=0,\"\",M1011-M1010)","v":76},{"$f":"IF(N1011-N1010=0,\"\",N1011-N1010)","v":949},{"$f":"IF(M1011=0,0,H1011/M1011)","v":0.81957585644371944},{"$f":"IF(M1011=0,0,K1011/M1011)","v":9.3311582381729194E-2},{"$f":"IF(M1011=0,0,L1011/M1011)","v":8.7112561174551392E-2},{"$f":"L1011*100/B$1285","v":9434.6289752650173}]
["2020-04-14T17:00:00",16,"Puglia",611,62,673,1879,2552,40,53,288,278,3118,33071,{"$f":"IF(P1012=\"x2\",M1012,O1011)","v":1712},{"$f":"IF(M1012>O1011*2,\"x2\",O1011)","v":1712},{"$f":"IF(P1012=\"x2\",M1012,\"\")","v":""},null,{"$f":"M1012*100/M1345","v":1.9189109349613509},{"$f":"IF(J1012-J1011=0,\"\",J1012-J1011)","v":-23},{"$f":"IF(K1012-K1011=0,\"\",K1012-K1011)","v":2},{"$f":"IF(L1012-L1011=0,\"\",L1012-L1011)","v":11},{"$f":"IF(M1012-M1011=0,\"\",M1012-M1011)","v":53},{"$f":"IF(N1012-N1011=0,\"\",N1012-N1011)","v":1149},{"$f":"IF(M1012=0,0,H1012/M1012)","v":0.81847338037203332},{"$f":"IF(M1012=0,0,K1012/M1012)","v":9.2366901860166772E-2},{"$f":"IF(M1012=0,0,L1012/M1012)","v":8.9159717767799865E-2},{"$f":"L1012*100/B$1285","v":9823.3215547703185}]
["2020-04-15T17:00:00",16,"Puglia",592,73,665,1908,2573,21,66,323,288,3184,34518,{"$f":"IF(P1013=\"x2\",M1013,O1012)","v":1712},{"$f":"IF(M1013>O1012*2,\"x2\",O1012)","v":1712},{"$f":"IF(P1013=\"x2\",M1013,\"\")","v":""},null,{"$f":"M1013*100/M1346","v":1.9278859253428597},{"$f":"IF(J1013-J1012=0,\"\",J1013-J1012)","v":13},{"$f":"IF(K1013-K1012=0,\"\",K1013-K1012)","v":35},{"$f":"IF(L1013-L1012=0,\"\",L1013-L1012)","v":10},{"$f":"IF(M1013-M1012=0,\"\",M1013-M1012)","v":66},{"$f":"IF(N1013-N1012=0,\"\",N1013-N1012)","v":1447},{"$f":"IF(M1013=0,0,H1013/M1013)","v":0.80810301507537685},{"$f":"IF(M1013=0,0,K1013/M1013)","v":0.10144472361809045},{"$f":"IF(M1013=0,0,L1013/M1013)","v":9.0452261306532666E-2},{"$f":"L1013*100/B$1285","v":10176.678445229682}]
[{"$f":"A1013 + 1","v":"2020-04-16T17:00:00"},null,null,null,null,null,null,null,null,null,null,null,null,null,null,"Media x2",{"$f":"COUNT(M962:M1013) / COUNT(Q962:Q1013)","v":5.2}]
[{"$f":"A1014+1","v":"2020-04-17T17:00:00"}]
[{"$f":"A1015+1","v":"2020-04-18T17:00:00"}]
[null,null,null,null,{"$f":"E1013/$M1013","v":2.2927135678391958E-2},null,null,{"$f":"H1013/$M1013","v":0.80810301507537685},null,null,{"$f":"K1013/$M1013","v":0.10144472361809045},{"$f":"L1013/$M1013","v":9.0452261306532666E-2},null,{"$f":"N1013/$M1013","v":10.84108040201005}]
[]
[]
[]
["Data","Codice","Regione","Ricoverati","Terap. Intens.","Ospedalizzati","Quarantena","Positivi","+ Positivi","Nuovi","Guariti","Deceduti","Totale","Tamponi",null,null,"x 2",null,"% su Tot.","+ Nuovi","+ Guariti","+ Deceduti","+ Totali","+ Tamponi","% Positivi","% Guariti","% Deceduti","P. Stimati"]
["2020-02-24T18:00:00",17,"Basilicata",0,0,0,0,0,0,0,0,0,0,0,{"$f":"M1022","v":0},null,{"$f":"M1022","v":0},null,{"$f":"M1022*100/M1295","v":0},null,null,null,null,null,{"$f":"IF(M1022=0,0,H1022/M1022)","v":0},{"$f":"IF(M1022=0,0,K1022/M1022)","v":0},{"$f":"IF(M1022=0,0,L1022/M1022)","v":0},{"$f":"L1022*100/B$1285","v":0}]
["2020-02-25T18:00:00",17,"Basilicata",0,0,0,0,0,0,0,0,0,0,0,{"$f":"IF(P1023=\"x2\",M1023,O1022)","v":0},{"$f":"IF(M1023>O1022*2,\"x2\",O1022)","v":0},{"$f":"IF(P1023=\"x2\",M1023,\"\")","v":""},null,{"$f":"M1023*100/M1296","v":0},{"$f":"IF(J1023-J1022=0,\"\",J1023-J1022)","v":""},{"$f":"IF(K1023-K1022=0,\"\",K1023-K1022)","v":""},{"$f":"IF(L1023-L1022=0,\"\",L1023-L1022)","v":""},{"$f":"IF(M1023-M1022=0,\"\",M1023-M1022)","v":""},{"$f":"IF(N1023-N1022=0,\"\",N1023-N1022)","v":""},0,0,0,{"$f":"L1023*100/B$1285","v":0}]
["2020-02-26T18:00:00",17,"Basilicata",0,0,0,0,0,0,0,0,0,0,0,0,0,"",null,{"$f":"M1024*100/M1297","v":0},"","","","","",0,0,0,{"$f":"L1024*100/B$1285","v":0}]
["2020-02-27T18:00:00",17,"Basilicata",0,0,0,0,0,0,0,0,0,0,0,0,0,"",null,{"$f":"M1025*100/M1298","v":0},"","","","","",0,0,0,{"$f":"L1025*100/B$1285","v":0}]
["2020-02-28T18:00:00",17,"Basilicata",0,0,0,0,0,0,0,0,0,0,0,0,0,"",null,{"$f":"M1026*100/M1299","v":0},"","","","","",0,0,0,{"$f":"L1026*100/B$1285","v":0}]
["2020-02-29T17:00:00",17,"Basilicata",0,0,0,0,0,0,0,0,0,0,32,0,0,"",null,{"$f":"M1027*100/M1300","v":0},"","","","",32,0,0,0,{"$f":"L1027*100/B$1285","v":0}]
["2020-03-01T17:00:00",17,"Basilicata",0,0,0,0,0,0,0,0,0,0,39,0,0,"",null,{"$f":"M1028*100/M1301","v":0},"","","","",7,0,0,0,{"$f":"L1028*100/B$1285","v":0}]
["2020-03-02T18:00:00",17,"Basilicata",0,0,0,0,0,0,0,0,0,0,39,0,0,"",null,{"$f":"M1029*100/M1302","v":0},"","","","","",0,0,0,{"$f":"L1029*100/B$1285","v":0}]
["2020-03-03T18:00:00",17,"Basilicata",0,0,0,1,1,1,1,0,0,1,42,1,"x2",1,null,{"$f":"M1030*100/M1303","v":3.9968025579536368E-2},1,"","",1,3,1,0,0,{"$f":"L1030*100/B$1285","v":0}]
["2020-03-04T17:00:00",17,"Basilicata",0,0,0,1,1,0,0,0,0,1,48,1,1,"",null,{"$f":"M1031*100/M1304","v":3.2372936225315639E-2},-1,"","","",6,1,0,0,{"$f":"L1031*100/B$1285","v":0}]
["2020-03-05T17:00:00",17,"Basilicata",0,0,0,1,1,0,0,0,0,1,54,1,1,"",null,{"$f":"M1032*100/M1305","v":2.5920165889061691E-2},"","","","",6,1,0,0,{"$f":"L1032*100/B$1285","v":0}]
["2020-03-06T17:00:00",17,"Basilicata",1,0,1,2,3,2,2,0,0,3,63,3,"x2",3,null,{"$f":"M1033*100/M1306","v":6.4710957722174292E-2},2,"","",2,9,1,0,0,{"$f":"L1033*100/B$1285","v":0}]
["2020-03-07T18:00:00",17,"Basilicata",1,0,1,2,3,0,0,0,0,3,75,3,3,"",null,{"$f":"M1034*100/M1307","v":5.0994390617032127E-2},-2,"","","",12,1,0,0,{"$f":"L1034*100/B$1285","v":0}]
["2020-03-08T18:00:00",17,"Basilicata",2,0,2,2,4,1,1,0,0,4,123,3,3,"",null,{"$f":"M1035*100/M1308","v":5.4237288135593219E-2},1,"","",1,48,1,0,0,{"$f":"L1035*100/B$1285","v":0}]
["2020-03-09T18:00:00",17,"Basilicata",2,0,2,3,5,1,1,0,0,5,135,3,3,"",null,{"$f":"M1036*100/M1309","v":5.4513737461840385E-2},"","","",1,12,1,0,0,{"$f":"L1036*100/B$1285","v":0}]
["2020-03-10T18:00:00",17,"Basilicata",2,0,2,5,7,2,2,0,0,7,148,7,"x2",7,null,{"$f":"M1037*100/M1310","v":6.8972312543107692E-2},1,"","",2,13,1,0,0,{"$f":"L1037*100/B$1285","v":0}]
["2020-03-11T17:00:00",17,"Basilicata",1,1,2,6,8,1,1,0,0,8,155,7,7,"",null,{"$f":"M1038*100/M1311","v":6.4195153265928423E-2},-1,"","",1,7,1,0,0,{"$f":"L1038*100/B$1285","v":0}]
["2020-03-12T17:00:00",17,"Basilicata",1,1,2,6,8,0,0,0,0,8,155,7,7,"",null,{"$f":"M1039*100/M1312","v":5.2934559650631909E-2},-1,"","","","",1,0,0,{"$f":"L1039*100/B$1285","v":0}]
["2020-03-13T17:00:00",17,"Basilicata",1,1,2,8,10,2,2,0,0,10,155,7,7,"",null,{"$f":"M1040*100/M1313","v":5.6625141562853906E-2},2,"","",2,"",1,0,0,{"$f":"L1040*100/B$1285","v":0}]
["2020-03-14T17:00:00",17,"Basilicata",0,2,2,8,10,0,0,0,0,10,155,7,7,"",null,{"$f":"M1041*100/M1314","v":4.7265680389469204E-2},-2,"","","","",1,0,0,{"$f":"L1041*100/B$1285","v":0}]
["2020-03-15T17:00:00",17,"Basilicata",0,2,2,9,11,1,1,0,0,11,208,7,7,"",null,{"$f":"M1042*100/M1315","v":4.4449832302905404E-2},1,"","",1,53,1,0,0,{"$f":"L1042*100/B$1285","v":0}]
["2020-03-16T17:00:00",17,"Basilicata",1,2,3,9,12,1,1,0,0,12,230,7,7,"",null,{"$f":"M1043*100/M1316","v":4.2887776983559688E-2},"","","",1,22,1,0,0,{"$f":"L1043*100/B$1285","v":0}]
["2020-03-17T17:00:00",17,"Basilicata",5,2,7,13,20,8,8,0,0,20,262,20,"x2",20,null,{"$f":"M1044*100/M1317","v":6.3479972068812285E-2},7,"","",8,32,1,0,0,{"$f":"L1044*100/B$1285","v":0}]
["2020-03-18T17:00:00",17,"Basilicata",9,2,11,16,27,7,7,0,0,27,262,20,20,"",null,{"$f":"M1045*100/M1318","v":7.5602721697981129E-2},-1,"","",7,"",1,0,0,{"$f":"L1045*100/B$1285","v":0}]
["2020-03-19T17:00:00",17,"Basilicata",8,5,13,24,37,10,10,0,0,37,353,20,20,"",null,{"$f":"M1046*100/M1319","v":9.0166930668941145E-2},3,"","",10,91,1,0,0,{"$f":"L1046*100/B$1285","v":0}]
["2020-03-20T17:00:00",17,"Basilicata",8,5,13,39,52,15,15,0,0,52,443,52,"x2",52,null,{"$f":"M1047*100/M1320","v":0.11058888581697539},5,"","",15,{"$f":"IF(N1047-N1046=0,\"\",N1047-N1046)","v":90},1,0,0,{"$f":"L1047*100/B$1285","v":0}]
["2020-03-21T17:00:00",17,"Basilicata",12,7,19,47,66,14,14,0,0,66,522,52,52,"",null,{"$f":"M1048*100/M1321","v":0.12318488932024338},-1,"","",{"$f":"IF(M1048-M1047=0,\"\",M1048-M1047)","v":14},79,1,0,0,{"$f":"L1048*100/B$1285","v":0}]
["2020-03-22T17:00:00",17,"Basilicata",13,10,23,58,81,15,15,0,0,81,643,52,52,"",null,{"$f":"M1049*100/M1322","v":0.13696777029997634},1,"","",15,121,1,0,0,{"$f":"L1049*100/B$1285","v":0}]
["2020-03-23T17:00:00",17,"Basilicata",15,12,27,62,89,8,8,0,1,90,696,52,52,"",null,{"$f":"M1050*100/M1323","v":0.14078558355624385},-7,"",1,9,53,0.98888888888888893,0,1.1111111111111112E-2,{"$f":"L1050*100/B$1285","v":35.335689045936398}]
["2020-03-24T17:00:00",17,"Basilicata",14,12,26,65,91,2,2,0,1,92,744,52,52,"",null,{"$f":"M1051*100/M1324","v":0.13299410200069389},-6,"","",2,48,0.98913043478260865,0,1.0869565217391304E-2,{"$f":"L1051*100/B$1285","v":35.335689045936398}]
["2020-03-25T17:00:00",17,"Basilicata",20,14,34,78,112,21,21,0,1,113,857,113,"x2",113,null,{"$f":"M1052*100/M1325","v":0.15191030570268599},19,"","",21,113,0.99115044247787609,0,8.8495575221238937E-3,{"$f":"L1052*100/B$1285","v":35.335689045936398}]
["2020-03-26T17:00:00",17,"Basilicata",22,16,38,95,133,21,21,0,1,134,1046,113,113,"",null,{"$f":"M1053*100/M1326","v":0.16637902134369684},"","","",21,{"$f":"IF(N1053-N1052=0,\"\",N1053-N1052)","v":189},0.9925373134328358,0,7.462686567164179E-3,{"$f":"L1053*100/B$1285","v":35.335689045936398}]
["2020-03-27T17:00:00",17,"Basilicata",22,15,37,110,147,14,17,1,3,151,1254,{"$f":"IF(P1054=\"x2\",M1054,O1053)","v":113},{"$f":"IF(M1054>O1053*2,\"x2\",O1053)","v":113},{"$f":"IF(P1054=\"x2\",M1054,\"\")","v":""},null,{"$f":"M1054*100/M1327","v":0.17457051030081622},{"$f":"IF(J1054-J1053=0,\"\",J1054-J1053)","v":-4},1,2,17,208,0.97350993377483441,6.6225165562913907E-3,1.9867549668874173E-2,{"$f":"L1054*100/B$1285","v":106.00706713780919}]
["2020-03-28T17:00:00",17,"Basilicata",26,19,45,133,178,31,31,1,3,182,1421,113,113,"",null,{"$f":"M1055*100/M1328","v":0.19681633359287135},14,"","",31,167,0.97802197802197799,5.4945054945054949E-3,1.6483516483516484E-2,{"$f":"L1055*100/B$1285","v":106.00706713780919}]
["2020-03-29T17:00:00",17,"Basilicata",32,18,50,147,197,19,20,1,4,202,1585,113,113,"",null,{"$f":"M1056*100/M1329","v":0.20677865471035634},-11,"",1,20,164,0.97524752475247523,4.9504950495049506E-3,1.9801980198019802E-2,{"$f":"L1056*100/B$1285","v":141.34275618374559}]
["2020-03-30T17:00:00",17,"Basilicata",36,18,54,154,208,11,12,1,5,214,1833,113,113,"",null,{"$f":"M1057*100/M1330","v":0.21034215001130344},-8,"",1,12,248,0.9719626168224299,4.6728971962616819E-3,2.336448598130841E-2,{"$f":"L1057*100/B$1285","v":176.67844522968198}]
["2020-03-31T17:00:00",17,"Basilicata",37,17,54,162,216,8,12,3,7,226,2043,113,113,"",null,{"$f":"M1058*100/M1331","v":0.21362673926194797},"",2,2,12,210,0.95575221238938057,1.3274336283185841E-2,3.0973451327433628E-2,{"$f":"L1058*100/B$1285","v":247.34982332155477}]
["2020-04-01T17:00:00",17,"Basilicata",39,15,54,171,225,9,11,3,9,237,2262,237,"x2",237,null,{"$f":"M1059*100/M1332","v":0.21433610071083617},-1,"",2,11,{"$f":"IF(N1059-N1058=0,\"\",N1059-N1058)","v":219},{"$f":"IF(M1059=0,0,H1059/M1059)","v":0.94936708860759489},{"$f":"IF(M1059=0,0,K1059/M1059)","v":1.2658227848101266E-2},{"$f":"IF(M1059=0,0,L1059/M1059)","v":3.7974683544303799E-2},{"$f":"L1059*100/B$1285","v":318.02120141342755}]
["2020-04-02T17:00:00",17,"Basilicata",38,19,57,176,233,8,9,3,10,246,2427,{"$f":"IF(P1060=\"x2\",M1060,O1059)","v":237},{"$f":"IF(M1060>O1059*2,\"x2\",O1059)","v":237},{"$f":"IF(P1060=\"x2\",M1060,\"\")","v":""},null,{"$f":"M1060*100/M1333","v":0.21346384130785651},{"$f":"IF(J1060-J1059=0,\"\",J1060-J1059)","v":-2},{"$f":"IF(K1060-K1059=0,\"\",K1060-K1059)","v":""},{"$f":"IF(L1060-L1059=0,\"\",L1060-L1059)","v":1},{"$f":"IF(M1060-M1059=0,\"\",M1060-M1059)","v":9},165,0.94715447154471544,1.2195121951219513E-2,4.065040650406504E-2,{"$f":"L1060*100/B$1285","v":353.35689045936397}]
["2020-04-03T17:00:00",17,"Basilicata",41,19,60,187,247,14,15,3,11,261,2622,{"$f":"IF(P1061=\"x2\",M1061,O1060)","v":237},{"$f":"IF(M1061>O1060*2,\"x2\",O1060)","v":237},{"$f":"IF(P1061=\"x2\",M1061,\"\")","v":""},null,{"$f":"M1061*100/M1334","v":0.21781401520525423},{"$f":"IF(J1061-J1060=0,\"\",J1061-J1060)","v":6},{"$f":"IF(K1061-K1060=0,\"\",K1061-K1060)","v":""},{"$f":"IF(L1061-L1060=0,\"\",L1061-L1060)","v":1},{"$f":"IF(M1061-M1060=0,\"\",M1061-M1060)","v":15},195,0.94636015325670497,1.1494252873563218E-2,4.2145593869731802E-2,{"$f":"L1061*100/B$1285","v":388.69257950530033}]
["2020-04-04T17:00:00",17,"Basilicata",44,19,63,181,244,-3,3,9,11,264,2765,{"$f":"IF(P1062=\"x2\",M1062,O1061)","v":237},{"$f":"IF(M1062>O1061*2,\"x2\",O1061)","v":237},{"$f":"IF(P1062=\"x2\",M1062,\"\")","v":""},null,{"$f":"M1062*100/M1335","v":0.21182360870402464},{"$f":"IF(J1062-J1061=0,\"\",J1062-J1061)","v":-12},{"$f":"IF(K1062-K1061=0,\"\",K1062-K1061)","v":6},{"$f":"IF(L1062-L1061=0,\"\",L1062-L1061)","v":""},{"$f":"IF(M1062-M1061=0,\"\",M1062-M1061)","v":3},143,0.9242424242424242,3.4090909090909088E-2,4.1666666666666664E-2,{"$f":"L1062*100/B$1285","v":388.69257950530033}]
["2020-04-05T17:00:00",17,"Basilicata",46,18,64,190,254,10,14,11,13,278,2931,{"$f":"IF(P1063=\"x2\",M1063,O1062)","v":237},{"$f":"IF(M1063>O1062*2,\"x2\",O1062)","v":237},{"$f":"IF(P1063=\"x2\",M1063,\"\")","v":""},null,{"$f":"M1063*100/M1336","v":0.21559078077984925},{"$f":"IF(J1063-J1062=0,\"\",J1063-J1062)","v":11},{"$f":"IF(K1063-K1062=0,\"\",K1063-K1062)","v":2},{"$f":"IF(L1063-L1062=0,\"\",L1063-L1062)","v":2},{"$f":"IF(M1063-M1062=0,\"\",M1063-M1062)","v":14},166,0.91366906474820142,3.9568345323741004E-2,4.6762589928057555E-2,{"$f":"L1063*100/B$1285","v":459.36395759717311}]
["2020-04-06T17:00:00",17,"Basilicata",46,18,64,198,262,8,9,12,13,287,3061,{"$f":"IF(P1064=\"x2\",M1064,O1063)","v":237},{"$f":"IF(M1064>O1063*2,\"x2\",O1063)","v":237},{"$f":"IF(P1064=\"x2\",M1064,\"\")","v":""},null,{"$f":"M1064*100/M1337","v":0.21652696779255659},{"$f":"IF(J1064-J1063=0,\"\",J1064-J1063)","v":-5},{"$f":"IF(K1064-K1063=0,\"\",K1064-K1063)","v":1},{"$f":"IF(L1064-L1063=0,\"\",L1064-L1063)","v":""},{"$f":"IF(M1064-M1063=0,\"\",M1064-M1063)","v":9},130,0.91289198606271782,4.1811846689895474E-2,4.5296167247386762E-2,{"$f":"L1064*100/B$1285","v":459.36395759717311}]
["2020-04-07T17:00:00",17,"Basilicata",47,17,64,201,265,3,4,12,14,291,3160,{"$f":"IF(P1065=\"x2\",M1065,O1064)","v":237},{"$f":"IF(M1065>O1064*2,\"x2\",O1064)","v":237},{"$f":"IF(P1065=\"x2\",M1065,\"\")","v":""},null,{"$f":"M1065*100/M1338","v":0.21462392872420458},{"$f":"IF(J1065-J1064=0,\"\",J1065-J1064)","v":-5},{"$f":"IF(K1065-K1064=0,\"\",K1065-K1064)","v":""},{"$f":"IF(L1065-L1064=0,\"\",L1065-L1064)","v":1},{"$f":"IF(M1065-M1064=0,\"\",M1065-M1064)","v":4},{"$f":"IF(N1065-N1064=0,\"\",N1065-N1064)","v":99},{"$f":"IF(M1065=0,0,H1065/M1065)","v":0.9106529209621993},{"$f":"IF(M1065=0,0,K1065/M1065)","v":4.1237113402061855E-2},{"$f":"IF(M1065=0,0,L1065/M1065)","v":4.8109965635738834E-2},{"$f":"L1065*100/B$1285","v":494.69964664310953}]
["2020-04-08T17:00:00",17,"Basilicata",48,17,65,205,270,5,6,13,14,297,3296,{"$f":"IF(P1066=\"x2\",M1066,O1065)","v":237},{"$f":"IF(M1066>O1065*2,\"x2\",O1065)","v":237},{"$f":"IF(P1066=\"x2\",M1066,\"\")","v":""},null,{"$f":"M1066*100/M1339","v":0.21302233506907087},{"$f":"IF(J1066-J1065=0,\"\",J1066-J1065)","v":2},{"$f":"IF(K1066-K1065=0,\"\",K1066-K1065)","v":1},{"$f":"IF(L1066-L1065=0,\"\",L1066-L1065)","v":""},{"$f":"IF(M1066-M1065=0,\"\",M1066-M1065)","v":6},{"$f":"IF(N1066-N1065=0,\"\",N1066-N1065)","v":136},{"$f":"IF(M1066=0,0,H1066/M1066)","v":0.90909090909090906},{"$f":"IF(M1066=0,0,K1066/M1066)","v":4.3771043771043773E-2},{"$f":"IF(M1066=0,0,L1066/M1066)","v":4.7138047138047139E-2},{"$f":"L1066*100/B$1285","v":494.69964664310953}]
["2020-04-09T17:00:00",17,"Basilicata",50,17,67,208,275,5,6,13,15,303,3474,{"$f":"IF(P1067=\"x2\",M1067,O1066)","v":237},{"$f":"IF(M1067>O1066*2,\"x2\",O1066)","v":237},{"$f":"IF(P1067=\"x2\",M1067,\"\")","v":""},null,{"$f":"M1067*100/M1340","v":0.21096458858423961},{"$f":"IF(J1067-J1066=0,\"\",J1067-J1066)","v":""},{"$f":"IF(K1067-K1066=0,\"\",K1067-K1066)","v":""},{"$f":"IF(L1067-L1066=0,\"\",L1067-L1066)","v":1},{"$f":"IF(M1067-M1066=0,\"\",M1067-M1066)","v":6},{"$f":"IF(N1067-N1066=0,\"\",N1067-N1066)","v":178},{"$f":"IF(M1067=0,0,H1067/M1067)","v":0.90759075907590758},{"$f":"IF(M1067=0,0,K1067/M1067)","v":4.2904290429042903E-2},{"$f":"IF(M1067=0,0,L1067/M1067)","v":4.9504950495049507E-2},{"$f":"L1067*100/B$1285","v":530.03533568904595}]
["2020-04-10T17:00:00",17,"Basilicata",59,15,74,205,279,4,5,14,15,308,3696,{"$f":"IF(P1068=\"x2\",M1068,O1067)","v":237},{"$f":"IF(M1068>O1067*2,\"x2\",O1067)","v":237},{"$f":"IF(P1068=\"x2\",M1068,\"\")","v":""},null,{"$f":"M1068*100/M1341","v":0.20870460844169483},{"$f":"IF(J1068-J1067=0,\"\",J1068-J1067)","v":-1},{"$f":"IF(K1068-K1067=0,\"\",K1068-K1067)","v":1},{"$f":"IF(L1068-L1067=0,\"\",L1068-L1067)","v":""},{"$f":"IF(M1068-M1067=0,\"\",M1068-M1067)","v":5},{"$f":"IF(N1068-N1067=0,\"\",N1068-N1067)","v":222},{"$f":"IF(M1068=0,0,H1068/M1068)","v":0.9058441558441559},{"$f":"IF(M1068=0,0,K1068/M1068)","v":4.5454545454545456E-2},{"$f":"IF(M1068=0,0,L1068/M1068)","v":4.8701298701298704E-2},{"$f":"L1068*100/B$1285","v":530.03533568904595}]
["2020-04-11T17:00:00",17,"Basilicata",60,12,72,209,281,2,4,14,17,312,4050,{"$f":"IF(P1069=\"x2\",M1069,O1068)","v":237},{"$f":"IF(M1069>O1068*2,\"x2\",O1068)","v":237},{"$f":"IF(P1069=\"x2\",M1069,\"\")","v":""},null,{"$f":"M1069*100/M1342","v":0.20489784660243907},{"$f":"IF(J1069-J1068=0,\"\",J1069-J1068)","v":-1},{"$f":"IF(K1069-K1068=0,\"\",K1069-K1068)","v":""},{"$f":"IF(L1069-L1068=0,\"\",L1069-L1068)","v":2},{"$f":"IF(M1069-M1068=0,\"\",M1069-M1068)","v":4},{"$f":"IF(N1069-N1068=0,\"\",N1069-N1068)","v":354},{"$f":"IF(M1069=0,0,H1069/M1069)","v":0.90064102564102566},{"$f":"IF(M1069=0,0,K1069/M1069)","v":4.4871794871794872E-2},{"$f":"IF(M1069=0,0,L1069/M1069)","v":5.4487179487179488E-2},{"$f":"L1069*100/B$1285","v":600.70671378091868}]
["2020-04-12T17:00:00",17,"Basilicata",61,12,73,204,277,-4,3,20,18,315,4355,{"$f":"IF(P1070=\"x2\",M1070,O1069)","v":237},{"$f":"IF(M1070>O1069*2,\"x2\",O1069)","v":237},{"$f":"IF(P1070=\"x2\",M1070,\"\")","v":""},null,{"$f":"M1070*100/M1343","v":0.20145430824427774},{"$f":"IF(J1070-J1069=0,\"\",J1070-J1069)","v":-1},{"$f":"IF(K1070-K1069=0,\"\",K1070-K1069)","v":6},{"$f":"IF(L1070-L1069=0,\"\",L1070-L1069)","v":1},{"$f":"IF(M1070-M1069=0,\"\",M1070-M1069)","v":3},{"$f":"IF(N1070-N1069=0,\"\",N1070-N1069)","v":305},{"$f":"IF(M1070=0,0,H1070/M1070)","v":0.87936507936507935},{"$f":"IF(M1070=0,0,K1070/M1070)","v":6.3492063492063489E-2},{"$f":"IF(M1070=0,0,L1070/M1070)","v":5.7142857142857141E-2},{"$f":"L1070*100/B$1285","v":636.0424028268551}]
["2020-04-13T17:00:00",17,"Basilicata",64,12,76,194,270,-7,4,31,18,319,4545,{"$f":"IF(P1071=\"x2\",M1071,O1070)","v":237},{"$f":"IF(M1071>O1070*2,\"x2\",O1070)","v":237},{"$f":"IF(P1071=\"x2\",M1071,\"\")","v":""},null,{"$f":"M1071*100/M1344","v":0.19997993931643221},{"$f":"IF(J1071-J1070=0,\"\",J1071-J1070)","v":1},{"$f":"IF(K1071-K1070=0,\"\",K1071-K1070)","v":11},{"$f":"IF(L1071-L1070=0,\"\",L1071-L1070)","v":""},{"$f":"IF(M1071-M1070=0,\"\",M1071-M1070)","v":4},{"$f":"IF(N1071-N1070=0,\"\",N1071-N1070)","v":190},{"$f":"IF(M1071=0,0,H1071/M1071)","v":0.84639498432601878},{"$f":"IF(M1071=0,0,K1071/M1071)","v":9.7178683385579931E-2},{"$f":"IF(M1071=0,0,L1071/M1071)","v":5.6426332288401257E-2},{"$f":"L1071*100/B$1285","v":636.0424028268551}]
["2020-04-14T17:00:00",17,"Basilicata",62,12,74,191,265,-5,0,35,19,319,4759,{"$f":"IF(P1072=\"x2\",M1072,O1071)","v":237},{"$f":"IF(M1072>O1071*2,\"x2\",O1071)","v":237},{"$f":"IF(P1072=\"x2\",M1072,\"\")","v":""},null,{"$f":"M1072*100/M1345","v":0.19632218994633449},{"$f":"IF(J1072-J1071=0,\"\",J1072-J1071)","v":-4},{"$f":"IF(K1072-K1071=0,\"\",K1072-K1071)","v":4},{"$f":"IF(L1072-L1071=0,\"\",L1072-L1071)","v":1},{"$f":"IF(M1072-M1071=0,\"\",M1072-M1071)","v":""},{"$f":"IF(N1072-N1071=0,\"\",N1072-N1071)","v":214},{"$f":"IF(M1072=0,0,H1072/M1072)","v":0.83072100313479624},{"$f":"IF(M1072=0,0,K1072/M1072)","v":0.109717868338558},{"$f":"IF(M1072=0,0,L1072/M1072)","v":5.9561128526645767E-2},{"$f":"L1072*100/B$1285","v":671.37809187279152}]
["2020-04-15T17:00:00",17,"Basilicata",60,12,72,189,261,-4,1,38,21,320,5037,{"$f":"IF(P1073=\"x2\",M1073,O1072)","v":237},{"$f":"IF(M1073>O1072*2,\"x2\",O1072)","v":237},{"$f":"IF(P1073=\"x2\",M1073,\"\")","v":""},null,{"$f":"M1073*100/M1346","v":0.19375737943144319},{"$f":"IF(J1073-J1072=0,\"\",J1073-J1072)","v":1},{"$f":"IF(K1073-K1072=0,\"\",K1073-K1072)","v":3},{"$f":"IF(L1073-L1072=0,\"\",L1073-L1072)","v":2},{"$f":"IF(M1073-M1072=0,\"\",M1073-M1072)","v":1},{"$f":"IF(N1073-N1072=0,\"\",N1073-N1072)","v":278},{"$f":"IF(M1073=0,0,H1073/M1073)","v":0.81562500000000004},{"$f":"IF(M1073=0,0,K1073/M1073)","v":0.11874999999999999},{"$f":"IF(M1073=0,0,L1073/M1073)","v":6.5625000000000003E-2},{"$f":"L1073*100/B$1285","v":742.04946996466424}]
[{"$f":"A1073 + 1","v":"2020-04-16T17:00:00"},null,null,null,null,null,null,null,null,null,null,null,null,null,null,"Media x2",{"$f":"COUNT(M1022:M1073) / COUNT(Q1022:Q1073)","v":6.5}]
[{"$f":"A1074+1","v":"2020-04-17T17:00:00"}]
[{"$f":"A1075+1","v":"2020-04-18T17:00:00"}]
[null,null,null,null,{"$f":"E1073/$M1073","v":3.7499999999999999E-2},null,null,{"$f":"H1073/$M1073","v":0.81562500000000004},null,null,{"$f":"K1073/$M1073","v":0.11874999999999999},{"$f":"L1073/$M1073","v":6.5625000000000003E-2},null,{"$f":"N1073/$M1073","v":15.740625}]
[]
[]
[]
["Data","Codice","Regione","Ricoverati","Terap. Intens.","Ospedalizzati","Quarantena","Positivi","+ Positivi","Nuovi","Guariti","Deceduti","Totale","Tamponi",null,null,"x 2",null,"% su Tot.","+ Nuovi","+ Guariti","+ Deceduti","+ Totali","+ Tamponi","% Positivi","% Guariti","% Deceduti","P. Stimati"]
["2020-02-24T18:00:00",18,"Calabria",0,0,0,0,0,0,0,0,0,0,1,{"$f":"M1082","v":0},null,{"$f":"M1082","v":0},null,{"$f":"M1082*100/M1295","v":0},null,null,null,null,null,{"$f":"IF(M1082=0,0,H1082/M1082)","v":0},{"$f":"IF(M1082=0,0,K1082/M1082)","v":0},{"$f":"IF(M1082=0,0,L1082/M1082)","v":0},{"$f":"L1082*100/B$1285","v":0}]
["2020-02-25T18:00:00",18,"Calabria",0,0,0,0,0,0,0,0,0,0,2,{"$f":"IF(P1083=\"x2\",M1083,O1082)","v":0},{"$f":"IF(M1083>O1082*2,\"x2\",O1082)","v":0},{"$f":"IF(P1083=\"x2\",M1083,\"\")","v":""},null,{"$f":"M1083*100/M1296","v":0},{"$f":"IF(J1083-J1082=0,\"\",J1083-J1082)","v":""},{"$f":"IF(K1083-K1082=0,\"\",K1083-K1082)","v":""},{"$f":"IF(L1083-L1082=0,\"\",L1083-L1082)","v":""},{"$f":"IF(M1083-M1082=0,\"\",M1083-M1082)","v":""},{"$f":"IF(N1083-N1082=0,\"\",N1083-N1082)","v":1},0,0,0,{"$f":"L1083*100/B$1285","v":0}]
["2020-02-26T18:00:00",18,"Calabria",0,0,0,0,0,0,0,0,0,0,3,0,0,"",null,{"$f":"M1084*100/M1297","v":0},"","","","",1,0,0,0,{"$f":"L1084*100/B$1285","v":0}]
["2020-02-27T18:00:00",18,"Calabria",0,0,0,0,0,0,0,0,0,0,14,0,0,"",null,{"$f":"M1085*100/M1298","v":0},"","","","",11,0,0,0,{"$f":"L1085*100/B$1285","v":0}]
["2020-02-28T18:00:00",18,"Calabria",0,0,0,1,1,1,1,0,0,1,21,1,"x2",1,null,{"$f":"M1086*100/M1299","v":0.11261261261261261},1,"","",1,7,1,0,0,{"$f":"L1086*100/B$1285","v":0}]
["2020-02-29T17:00:00",18,"Calabria",0,0,0,1,1,0,0,0,0,1,27,1,1,"",null,{"$f":"M1087*100/M1300","v":8.8652482269503549E-2},-1,"","","",6,1,0,0,{"$f":"L1087*100/B$1285","v":0}]
["2020-03-01T17:00:00",18,"Calabria",0,0,0,1,1,0,0,0,0,1,35,1,1,"",null,{"$f":"M1088*100/M1301","v":5.9031877213695398E-2},"","","","",8,1,0,0,{"$f":"L1088*100/B$1285","v":0}]
["2020-03-02T18:00:00",18,"Calabria",0,0,0,1,1,0,0,0,0,1,39,1,1,"",null,{"$f":"M1089*100/M1302","v":4.9115913555992138E-2},"","","","",4,1,0,0,{"$f":"L1089*100/B$1285","v":0}]
["2020-03-03T18:00:00",18,"Calabria",0,0,0,1,1,0,0,0,0,1,39,1,1,"",null,{"$f":"M1090*100/M1303","v":3.9968025579536368E-2},"","","","","",1,0,0,{"$f":"L1090*100/B$1285","v":0}]
["2020-03-04T17:00:00",18,"Calabria",0,0,0,1,1,0,0,0,0,1,46,1,1,"",null,{"$f":"M1091*100/M1304","v":3.2372936225315639E-2},"","","","",7,1,0,0,{"$f":"L1091*100/B$1285","v":0}]
["2020-03-05T17:00:00",18,"Calabria",1,0,1,1,2,1,1,0,0,2,53,1,1,"",null,{"$f":"M1092*100/M1305","v":5.1840331778123382E-2},1,"","",1,7,1,0,0,{"$f":"L1092*100/B$1285","v":0}]
["2020-03-06T17:00:00",18,"Calabria",2,0,2,2,4,2,2,0,0,4,99,4,"x2",4,null,{"$f":"M1093*100/M1306","v":8.6281276962899056E-2},1,"","",2,46,1,0,0,{"$f":"L1093*100/B$1285","v":0}]
["2020-03-07T18:00:00",18,"Calabria",2,0,2,2,4,0,0,0,0,4,113,4,4,"",null,{"$f":"M1094*100/M1307","v":6.7992520822709498E-2},-2,"","","",14,1,0,0,{"$f":"L1094*100/B$1285","v":0}]
["2020-03-08T18:00:00",18,"Calabria",5,0,5,4,9,5,5,0,0,9,113,9,"x2",9,null,{"$f":"M1095*100/M1308","v":0.12203389830508475},5,"","",5,"",1,0,0,{"$f":"L1095*100/B$1285","v":0}]
["2020-03-09T18:00:00",18,"Calabria",8,0,8,1,9,0,0,2,0,11,173,9,9,"",null,{"$f":"M1096*100/M1309","v":0.11993022241604885},-5,2,"",2,60,0.81818181818181823,0.18181818181818182,0,{"$f":"L1096*100/B$1285","v":0}]
["2020-03-10T18:00:00",18,"Calabria",8,2,10,1,11,2,2,2,0,13,360,9,9,"",null,{"$f":"M1097*100/M1310","v":0.12809143758005714},2,"","",2,187,0.84615384615384615,0.15384615384615385,0,{"$f":"L1097*100/B$1285","v":0}]
["2020-03-11T17:00:00",18,"Calabria",10,2,12,5,17,6,6,2,0,19,405,19,"x2",19,null,{"$f":"M1098*100/M1311","v":0.15246348900657999},4,"","",6,45,0.89473684210526316,0.10526315789473684,0,{"$f":"L1098*100/B$1285","v":0}]
["2020-03-12T17:00:00",18,"Calabria",14,2,16,16,32,15,15,1,0,33,483,19,19,"",null,{"$f":"M1099*100/M1312","v":0.21835505855885662},9,-1,"",14,78,0.96969696969696972,3.0303030303030304E-2,0,{"$f":"L1099*100/B$1285","v":0}]
["2020-03-13T17:00:00",18,"Calabria",18,3,21,16,37,5,5,1,0,38,504,19,19,"",null,{"$f":"M1100*100/M1313","v":0.21517553793884484},-10,"","",5,21,0.97368421052631582,2.6315789473684209E-2,0,{"$f":"L1100*100/B$1285","v":0}]
["2020-03-14T17:00:00",18,"Calabria",22,4,26,33,59,22,22,1,0,60,711,60,"x2",60,null,{"$f":"M1101*100/M1314","v":0.28359408233681521},17,"","",22,207,0.98333333333333328,1.6666666666666666E-2,0,{"$f":"L1101*100/B$1285","v":0}]
["2020-03-15T17:00:00",18,"Calabria",32,6,38,28,66,7,7,1,1,68,884,60,60,"",null,{"$f":"M1102*100/M1315","v":0.27478078150886975},-15,"",1,8,173,0.97058823529411764,1.4705882352941176E-2,1.4705882352941176E-2,{"$f":"L1102*100/B$1285","v":35.335689045936398}]
["2020-03-16T17:00:00",18,"Calabria",36,7,43,44,87,21,21,1,1,89,1030,60,60,"",null,{"$f":"M1103*100/M1316","v":0.318084345961401},14,"","",21,146,0.97752808988764039,1.1235955056179775E-2,1.1235955056179775E-2,{"$f":"L1103*100/B$1285","v":35.335689045936398}]
["2020-03-17T17:00:00",18,"Calabria",45,10,55,57,112,25,25,1,1,114,1293,60,60,"",null,{"$f":"M1104*100/M1317","v":0.36183584079223008},4,"","",25,263,0.98245614035087714,8.771929824561403E-3,8.771929824561403E-3,{"$f":"L1104*100/B$1285","v":35.335689045936398}]
["2020-03-18T17:00:00",18,"Calabria",45,11,56,70,126,14,14,2,1,129,1668,129,"x2",129,null,{"$f":"M1105*100/M1318","v":0.36121300366813203},-11,1,"",15,375,0.97674418604651159,1.5503875968992248E-2,7.7519379844961239E-3,{"$f":"L1105*100/B$1285","v":35.335689045936398}]
["2020-03-19T17:00:00",18,"Calabria",60,13,73,91,164,38,38,2,3,169,2342,129,129,"",null,{"$f":"M1106*100/M1319","v":0.41184354819056901},24,"",2,40,674,0.97041420118343191,1.1834319526627219E-2,1.7751479289940829E-2,{"$f":"L1106*100/B$1285","v":106.00706713780919}]
["2020-03-20T17:00:00",18,"Calabria",71,16,87,114,201,37,37,2,4,207,2690,129,129,"",null,{"$f":"M1107*100/M1320","v":0.44022883392526746},-1,"",1,38,{"$f":"IF(N1107-N1106=0,\"\",N1107-N1106)","v":348},0.97101449275362317,9.6618357487922701E-3,1.932367149758454E-2,{"$f":"L1107*100/B$1285","v":141.34275618374559}]
["2020-03-21T17:00:00",18,"Calabria",73,16,89,136,225,24,24,5,5,235,3050,129,129,"",null,{"$f":"M1108*100/M1321","v":0.4386128634887454},-13,3,1,{"$f":"IF(M1108-M1107=0,\"\",M1108-M1107)","v":28},360,0.95744680851063835,2.1276595744680851E-2,2.1276595744680851E-2,{"$f":"L1108*100/B$1285","v":176.67844522968198}]
["2020-03-22T17:00:00",18,"Calabria",77,17,94,166,260,35,35,5,8,273,3666,273,"x2",273,null,{"$f":"M1109*100/M1322","v":0.46163211471473503},11,"",3,38,616,0.95238095238095233,1.8315018315018316E-2,2.9304029304029304E-2,{"$f":"L1109*100/B$1285","v":282.68551236749119}]
["2020-03-23T17:00:00",18,"Calabria",82,20,102,178,280,20,20,5,7,292,4073,273,273,"",null,{"$f":"M1110*100/M1323","v":0.45677100442692448},-15,"",-1,19,407,0.95890410958904104,1.7123287671232876E-2,2.3972602739726026E-2,{"$f":"L1110*100/B$1285","v":247.34982332155477}]
["2020-03-24T17:00:00",18,"Calabria",88,21,109,195,304,24,24,5,10,319,4486,273,273,"",null,{"$f":"M1111*100/M1324","v":0.46114259280675379},4,"",3,27,413,0.95297805642633227,1.5673981191222569E-2,3.1347962382445138E-2,{"$f":"L1111*100/B$1285","v":353.35689045936397}]
["2020-03-25T17:00:00",18,"Calabria",93,23,116,217,333,29,29,7,11,351,5058,273,273,"",null,{"$f":"M1112*100/M1325","v":0.47186298497029011},5,2,1,32,572,0.94871794871794868,1.9943019943019943E-2,3.1339031339031341E-2,{"$f":"L1112*100/B$1285","v":388.69257950530033}]
["2020-03-26T17:00:00",18,"Calabria",101,23,124,248,372,39,39,7,14,393,5933,273,273,"",null,{"$f":"M1113*100/M1326","v":0.48796235364233476},10,"",3,42,{"$f":"IF(N1113-N1112=0,\"\",N1113-N1112)","v":875},0.94656488549618323,1.7811704834605598E-2,3.5623409669211195E-2,{"$f":"L1113*100/B$1285","v":494.69964664310953}]
["2020-03-27T17:00:00",18,"Calabria",103,22,125,344,469,97,101,7,18,494,6901,{"$f":"IF(P1114=\"x2\",M1114,O1113)","v":273},{"$f":"IF(M1114>O1113*2,\"x2\",O1113)","v":273},{"$f":"IF(P1114=\"x2\",M1114,\"\")","v":""},null,{"$f":"M1114*100/M1327","v":0.57111147078545166},{"$f":"IF(J1114-J1113=0,\"\",J1114-J1113)","v":62},"",4,101,968,0.94939271255060731,1.417004048582996E-2,3.643724696356275E-2,{"$f":"L1114*100/B$1285","v":636.0424028268551}]
["2020-03-28T17:00:00",18,"Calabria",107,22,129,394,523,54,61,11,21,555,7760,555,"x2",555,null,{"$f":"M1115*100/M1328","v":0.60018167661562416},-40,4,3,61,859,0.94234234234234238,1.9819819819819819E-2,3.783783783783784E-2,{"$f":"L1115*100/B$1285","v":742.04946996466424}]
["2020-03-29T17:00:00",18,"Calabria",124,19,143,434,577,54,59,12,25,614,8485,555,555,"",null,{"$f":"M1116*100/M1329","v":0.62852521778296433},-2,1,4,59,725,0.93973941368078173,1.9543973941368076E-2,4.071661237785016E-2,{"$f":"L1116*100/B$1285","v":883.39222614840992}]
["2020-03-30T17:00:00",18,"Calabria",130,18,148,454,602,25,33,14,31,647,9013,555,555,"",null,{"$f":"M1117*100/M1330","v":0.63594098624912765},-26,2,6,33,528,0.93044822256568782,2.1638330757341576E-2,4.7913446676970631E-2,{"$f":"L1117*100/B$1285","v":1095.4063604240282}]
["2020-03-31T17:00:00",18,"Calabria",132,17,149,457,606,4,12,17,36,659,9327,555,555,"",null,{"$f":"M1118*100/M1331","v":0.62292044767090138},-21,3,5,12,314,0.91957511380880119,2.5796661608497723E-2,5.4628224582701064E-2,{"$f":"L1118*100/B$1285","v":1272.0848056537102}]
["2020-04-01T17:00:00",18,"Calabria",144,16,160,450,610,4,10,21,38,669,9983,555,555,"",null,{"$f":"M1119*100/M1332","v":0.60502468934830977},-2,4,2,10,{"$f":"IF(N1119-N1118=0,\"\",N1119-N1118)","v":656},{"$f":"IF(M1119=0,0,H1119/M1119)","v":0.91180866965620333},{"$f":"IF(M1119=0,0,K1119/M1119)","v":3.1390134529147982E-2},{"$f":"IF(M1119=0,0,L1119/M1119)","v":5.6801195814648729E-2},{"$f":"L1119*100/B$1285","v":1342.756183745583}]
["2020-04-02T17:00:00",18,"Calabria",163,19,182,445,627,17,22,23,41,691,10679,{"$f":"IF(P1120=\"x2\",M1120,O1119)","v":555},{"$f":"IF(M1120>O1119*2,\"x2\",O1119)","v":555},{"$f":"IF(P1120=\"x2\",M1120,\"\")","v":""},null,{"$f":"M1120*100/M1333","v":0.59960778188507657},{"$f":"IF(J1120-J1119=0,\"\",J1120-J1119)","v":12},{"$f":"IF(K1120-K1119=0,\"\",K1120-K1119)","v":2},{"$f":"IF(L1120-L1119=0,\"\",L1120-L1119)","v":3},{"$f":"IF(M1120-M1119=0,\"\",M1120-M1119)","v":22},696,0.90738060781476126,3.3285094066570188E-2,5.9334298118668596E-2,{"$f":"L1120*100/B$1285","v":1448.7632508833922}]
["2020-04-03T17:00:00",18,"Calabria",183,17,200,462,662,35,42,26,45,733,11608,{"$f":"IF(P1121=\"x2\",M1121,O1120)","v":555},{"$f":"IF(M1121>O1120*2,\"x2\",O1120)","v":555},{"$f":"IF(P1121=\"x2\",M1121,\"\")","v":""},null,{"$f":"M1121*100/M1334","v":0.61171522277950707},{"$f":"IF(J1121-J1120=0,\"\",J1121-J1120)","v":20},{"$f":"IF(K1121-K1120=0,\"\",K1121-K1120)","v":3},{"$f":"IF(L1121-L1120=0,\"\",L1121-L1120)","v":4},{"$f":"IF(M1121-M1120=0,\"\",M1121-M1120)","v":42},929,0.903137789904502,3.5470668485675309E-2,6.1391541609822645E-2,{"$f":"L1121*100/B$1285","v":1590.1060070671379}]
["2020-04-04T17:00:00",18,"Calabria",178,15,193,469,662,0,8,30,49,741,12314,{"$f":"IF(P1122=\"x2\",M1122,O1121)","v":555},{"$f":"IF(M1122>O1121*2,\"x2\",O1121)","v":555},{"$f":"IF(P1122=\"x2\",M1122,\"\")","v":""},null,{"$f":"M1122*100/M1335","v":0.59455035624879649},{"$f":"IF(J1122-J1121=0,\"\",J1122-J1121)","v":-34},{"$f":"IF(K1122-K1121=0,\"\",K1122-K1121)","v":4},{"$f":"IF(L1122-L1121=0,\"\",L1122-L1121)","v":4},{"$f":"IF(M1122-M1121=0,\"\",M1122-M1121)","v":8},706,0.89338731443994601,4.048582995951417E-2,6.6126855600539811E-2,{"$f":"L1122*100/B$1285","v":1731.4487632508833}]
["2020-04-05T17:00:00",18,"Calabria",174,13,187,519,706,44,54,33,56,795,13077,{"$f":"IF(P1123=\"x2\",M1123,O1122)","v":555},{"$f":"IF(M1123>O1122*2,\"x2\",O1122)","v":555},{"$f":"IF(P1123=\"x2\",M1123,\"\")","v":""},null,{"$f":"M1123*100/M1336","v":0.61652759251791422},{"$f":"IF(J1123-J1122=0,\"\",J1123-J1122)","v":46},{"$f":"IF(K1123-K1122=0,\"\",K1123-K1122)","v":3},{"$f":"IF(L1123-L1122=0,\"\",L1123-L1122)","v":7},{"$f":"IF(M1123-M1122=0,\"\",M1123-M1122)","v":54},763,0.88805031446540883,4.1509433962264149E-2,7.0440251572327042E-2,{"$f":"L1123*100/B$1285","v":1978.7985865724381}]
["2020-04-06T17:00:00",18,"Calabria",170,14,184,538,722,16,22,37,58,817,13633,{"$f":"IF(P1124=\"x2\",M1124,O1123)","v":555},{"$f":"IF(M1124>O1123*2,\"x2\",O1123)","v":555},{"$f":"IF(P1124=\"x2\",M1124,\"\")","v":""},null,{"$f":"M1124*100/M1337","v":0.61638513131191197},{"$f":"IF(J1124-J1123=0,\"\",J1124-J1123)","v":-32},{"$f":"IF(K1124-K1123=0,\"\",K1124-K1123)","v":4},{"$f":"IF(L1124-L1123=0,\"\",L1124-L1123)","v":2},{"$f":"IF(M1124-M1123=0,\"\",M1124-M1123)","v":22},556,0.88372093023255816,4.528763769889841E-2,7.0991432068543456E-2,{"$f":"L1124*100/B$1285","v":2049.4699646643107}]
["2020-04-07T17:00:00",18,"Calabria",169,14,183,550,733,11,16,40,60,833,14072,{"$f":"IF(P1125=\"x2\",M1125,O1124)","v":555},{"$f":"IF(M1125>O1124*2,\"x2\",O1124)","v":555},{"$f":"IF(P1125=\"x2\",M1125,\"\")","v":""},null,{"$f":"M1125*100/M1338","v":0.61437021521396018},{"$f":"IF(J1125-J1124=0,\"\",J1125-J1124)","v":-6},{"$f":"IF(K1125-K1124=0,\"\",K1125-K1124)","v":3},{"$f":"IF(L1125-L1124=0,\"\",L1125-L1124)","v":2},{"$f":"IF(M1125-M1124=0,\"\",M1125-M1124)","v":16},{"$f":"IF(N1125-N1124=0,\"\",N1125-N1124)","v":439},{"$f":"IF(M1125=0,0,H1125/M1125)","v":0.87995198079231696},{"$f":"IF(M1125=0,0,K1125/M1125)","v":4.8019207683073231E-2},{"$f":"IF(M1125=0,0,L1125/M1125)","v":7.202881152460984E-2},{"$f":"L1125*100/B$1285","v":2120.1413427561838}]
["2020-04-08T17:00:00",18,"Calabria",170,15,185,570,755,22,26,44,60,859,14977,{"$f":"IF(P1126=\"x2\",M1126,O1125)","v":555},{"$f":"IF(M1126>O1125*2,\"x2\",O1125)","v":555},{"$f":"IF(P1126=\"x2\",M1126,\"\")","v":""},null,{"$f":"M1126*100/M1339","v":0.61611510378562928},{"$f":"IF(J1126-J1125=0,\"\",J1126-J1125)","v":10},{"$f":"IF(K1126-K1125=0,\"\",K1126-K1125)","v":4},{"$f":"IF(L1126-L1125=0,\"\",L1126-L1125)","v":""},{"$f":"IF(M1126-M1125=0,\"\",M1126-M1125)","v":26},{"$f":"IF(N1126-N1125=0,\"\",N1126-N1125)","v":905},{"$f":"IF(M1126=0,0,H1126/M1126)","v":0.87892898719441215},{"$f":"IF(M1126=0,0,K1126/M1126)","v":5.1222351571594875E-2},{"$f":"IF(M1126=0,0,L1126/M1126)","v":6.9848661233993012E-2},{"$f":"L1126*100/B$1285","v":2120.1413427561838}]
["2020-04-09T17:00:00",18,"Calabria",168,15,183,582,765,10,15,48,61,874,15698,{"$f":"IF(P1127=\"x2\",M1127,O1126)","v":555},{"$f":"IF(M1127>O1126*2,\"x2\",O1126)","v":555},{"$f":"IF(P1127=\"x2\",M1127,\"\")","v":""},null,{"$f":"M1127*100/M1340","v":0.60852491888655258},{"$f":"IF(J1127-J1126=0,\"\",J1127-J1126)","v":-11},{"$f":"IF(K1127-K1126=0,\"\",K1127-K1126)","v":4},{"$f":"IF(L1127-L1126=0,\"\",L1127-L1126)","v":1},{"$f":"IF(M1127-M1126=0,\"\",M1127-M1126)","v":15},{"$f":"IF(N1127-N1126=0,\"\",N1127-N1126)","v":721},{"$f":"IF(M1127=0,0,H1127/M1127)","v":0.87528604118993136},{"$f":"IF(M1127=0,0,K1127/M1127)","v":5.4919908466819219E-2},{"$f":"IF(M1127=0,0,L1127/M1127)","v":6.9794050343249425E-2},{"$f":"L1127*100/B$1285","v":2155.4770318021201}]
["2020-04-10T17:00:00",18,"Calabria",168,14,182,604,786,21,27,50,65,901,16637,{"$f":"IF(P1128=\"x2\",M1128,O1127)","v":555},{"$f":"IF(M1128>O1127*2,\"x2\",O1127)","v":555},{"$f":"IF(P1128=\"x2\",M1128,\"\")","v":""},null,{"$f":"M1128*100/M1341","v":0.61052874092846443},{"$f":"IF(J1128-J1127=0,\"\",J1128-J1127)","v":12},{"$f":"IF(K1128-K1127=0,\"\",K1128-K1127)","v":2},{"$f":"IF(L1128-L1127=0,\"\",L1128-L1127)","v":4},{"$f":"IF(M1128-M1127=0,\"\",M1128-M1127)","v":27},{"$f":"IF(N1128-N1127=0,\"\",N1128-N1127)","v":939},{"$f":"IF(M1128=0,0,H1128/M1128)","v":0.87236403995560485},{"$f":"IF(M1128=0,0,K1128/M1128)","v":5.549389567147614E-2},{"$f":"IF(M1128=0,0,L1128/M1128)","v":7.2142064372918979E-2},{"$f":"L1128*100/B$1285","v":2296.8197879858658}]
["2020-04-11T17:00:00",18,"Calabria",169,15,184,608,792,6,14,57,66,915,17493,{"$f":"IF(P1129=\"x2\",M1129,O1128)","v":555},{"$f":"IF(M1129>O1128*2,\"x2\",O1128)","v":555},{"$f":"IF(P1129=\"x2\",M1129,\"\")","v":""},null,{"$f":"M1129*100/M1342","v":0.60090233859369147},{"$f":"IF(J1129-J1128=0,\"\",J1129-J1128)","v":-13},{"$f":"IF(K1129-K1128=0,\"\",K1129-K1128)","v":7},{"$f":"IF(L1129-L1128=0,\"\",L1129-L1128)","v":1},{"$f":"IF(M1129-M1128=0,\"\",M1129-M1128)","v":14},{"$f":"IF(N1129-N1128=0,\"\",N1129-N1128)","v":856},{"$f":"IF(M1129=0,0,H1129/M1129)","v":0.86557377049180328},{"$f":"IF(M1129=0,0,K1129/M1129)","v":6.2295081967213117E-2},{"$f":"IF(M1129=0,0,L1129/M1129)","v":7.2131147540983612E-2},{"$f":"L1129*100/B$1285","v":2332.1554770318021}]
["2020-04-12T17:00:00",18,"Calabria",165,14,179,616,795,3,8,62,66,923,18211,{"$f":"IF(P1130=\"x2\",M1130,O1129)","v":555},{"$f":"IF(M1130>O1129*2,\"x2\",O1129)","v":555},{"$f":"IF(P1130=\"x2\",M1130,\"\")","v":""},null,{"$f":"M1130*100/M1343","v":0.5902931000300583},{"$f":"IF(J1130-J1129=0,\"\",J1130-J1129)","v":-6},{"$f":"IF(K1130-K1129=0,\"\",K1130-K1129)","v":5},{"$f":"IF(L1130-L1129=0,\"\",L1130-L1129)","v":""},{"$f":"IF(M1130-M1129=0,\"\",M1130-M1129)","v":8},{"$f":"IF(N1130-N1129=0,\"\",N1130-N1129)","v":718},{"$f":"IF(M1130=0,0,H1130/M1130)","v":0.86132177681473454},{"$f":"IF(M1130=0,0,K1130/M1130)","v":6.7172264355362943E-2},{"$f":"IF(M1130=0,0,L1130/M1130)","v":7.1505958829902488E-2},{"$f":"L1130*100/B$1285","v":2332.1554770318021}]
["2020-04-13T17:00:00",18,"Calabria",160,12,172,619,791,-4,5,70,67,928,18596,{"$f":"IF(P1131=\"x2\",M1131,O1130)","v":555},{"$f":"IF(M1131>O1130*2,\"x2\",O1130)","v":555},{"$f":"IF(P1131=\"x2\",M1131,\"\")","v":""},null,{"$f":"M1131*100/M1344","v":0.58175982346598465},{"$f":"IF(J1131-J1130=0,\"\",J1131-J1130)","v":-3},{"$f":"IF(K1131-K1130=0,\"\",K1131-K1130)","v":8},{"$f":"IF(L1131-L1130=0,\"\",L1131-L1130)","v":1},{"$f":"IF(M1131-M1130=0,\"\",M1131-M1130)","v":5},{"$f":"IF(N1131-N1130=0,\"\",N1131-N1130)","v":385},{"$f":"IF(M1131=0,0,H1131/M1131)","v":0.85237068965517238},{"$f":"IF(M1131=0,0,K1131/M1131)","v":7.5431034482758619E-2},{"$f":"IF(M1131=0,0,L1131/M1131)","v":7.2198275862068964E-2},{"$f":"L1131*100/B$1285","v":2367.4911660777384}]
["2020-04-14T17:00:00",18,"Calabria",161,12,173,643,816,25,28,72,68,956,19014,{"$f":"IF(P1132=\"x2\",M1132,O1131)","v":555},{"$f":"IF(M1132>O1131*2,\"x2\",O1131)","v":555},{"$f":"IF(P1132=\"x2\",M1132,\"\")","v":""},null,{"$f":"M1132*100/M1345","v":0.5883511397764758},{"$f":"IF(J1132-J1131=0,\"\",J1132-J1131)","v":23},{"$f":"IF(K1132-K1131=0,\"\",K1132-K1131)","v":2},{"$f":"IF(L1132-L1131=0,\"\",L1132-L1131)","v":1},{"$f":"IF(M1132-M1131=0,\"\",M1132-M1131)","v":28},{"$f":"IF(N1132-N1131=0,\"\",N1132-N1131)","v":418},{"$f":"IF(M1132=0,0,H1132/M1132)","v":0.85355648535564854},{"$f":"IF(M1132=0,0,K1132/M1132)","v":7.5313807531380755E-2},{"$f":"IF(M1132=0,0,L1132/M1132)","v":7.1129707112970716E-2},{"$f":"L1132*100/B$1285","v":2402.8268551236747}]
["2020-04-15T17:00:00",18,"Calabria",156,11,167,652,819,3,15,81,71,971,19662,{"$f":"IF(P1133=\"x2\",M1133,O1132)","v":555},{"$f":"IF(M1133>O1132*2,\"x2\",O1132)","v":555},{"$f":"IF(P1133=\"x2\",M1133,\"\")","v":""},null,{"$f":"M1133*100/M1346","v":0.58793254821228547},{"$f":"IF(J1133-J1132=0,\"\",J1133-J1132)","v":-13},{"$f":"IF(K1133-K1132=0,\"\",K1133-K1132)","v":9},{"$f":"IF(L1133-L1132=0,\"\",L1133-L1132)","v":3},{"$f":"IF(M1133-M1132=0,\"\",M1133-M1132)","v":15},{"$f":"IF(N1133-N1132=0,\"\",N1133-N1132)","v":648},{"$f":"IF(M1133=0,0,H1133/M1133)","v":0.84346035015447995},{"$f":"IF(M1133=0,0,K1133/M1133)","v":8.3419155509783724E-2},{"$f":"IF(M1133=0,0,L1133/M1133)","v":7.312049433573635E-2},{"$f":"L1133*100/B$1285","v":2508.8339222614841}]
[{"$f":"A1133 + 1","v":"2020-04-16T17:00:00"},null,null,null,null,null,null,null,null,null,null,null,null,null,null,"Media x2",{"$f":"COUNT(M1082:M1133) / COUNT(Q1082:Q1133)","v":5.7777777777777777}]
[{"$f":"A1134+1","v":"2020-04-17T17:00:00"}]
[{"$f":"A1135+1","v":"2020-04-18T17:00:00"}]
[null,null,null,null,{"$f":"E1133/$M1133","v":1.132852729145211E-2},null,null,{"$f":"H1133/$M1133","v":0.84346035015447995},null,null,{"$f":"K1133/$M1133","v":8.3419155509783724E-2},{"$f":"L1133/$M1133","v":7.312049433573635E-2},null,{"$f":"N1133/$M1133","v":20.249227600411945}]
[]
[]
[]
["Data","Codice","Regione","Ricoverati","Terap. Intens.","Ospedalizzati","Quarantena","Positivi","+ Positivi","Nuovi","Guariti","Deceduti","Totale","Tamponi",null,null,"x 2",null,"% su Tot.","+ Nuovi","+ Guariti","+ Deceduti","+ Totali","+ Tamponi","% Positivi","% Guariti","% Deceduti","P. Stimati"]
["2020-02-24T18:00:00",19,"Sicilia",0,0,0,0,0,0,0,0,0,0,5,{"$f":"M1142","v":0},null,{"$f":"M1142","v":0},null,{"$f":"M1142*100/M1295","v":0},null,null,null,null,null,{"$f":"IF(M1142=0,0,H1142/M1142)","v":0},{"$f":"IF(M1142=0,0,K1142/M1142)","v":0},{"$f":"IF(M1142=0,0,L1142/M1142)","v":0},{"$f":"L1142*100/B$1285","v":0}]
["2020-02-25T18:00:00",19,"Sicilia",1,0,2,2,3,3,3,0,0,3,5,{"$f":"IF(P1143=\"x2\",M1143,O1142)","v":3},{"$f":"IF(M1143>O1142*2,\"x2\",O1142)","v":"x2"},{"$f":"IF(P1143=\"x2\",M1143,\"\")","v":3},null,{"$f":"M1143*100/M1296","v":0.93167701863354035},{"$f":"IF(J1143-J1142=0,\"\",J1143-J1142)","v":3},{"$f":"IF(K1143-K1142=0,\"\",K1143-K1142)","v":""},{"$f":"IF(L1143-L1142=0,\"\",L1143-L1142)","v":""},{"$f":"IF(M1143-M1142=0,\"\",M1143-M1142)","v":3},{"$f":"IF(N1143-N1142=0,\"\",N1143-N1142)","v":""},1,0,0,{"$f":"L1143*100/B$1285","v":0}]
["2020-02-26T18:00:00",19,"Sicilia",1,0,1,2,3,0,0,0,0,3,5,3,3,"",null,{"$f":"M1144*100/M1297","v":0.75},-3,"","","","",1,0,0,{"$f":"L1144*100/B$1285","v":0}]
["2020-02-27T18:00:00",19,"Sicilia",1,0,1,1,2,-1,-1,2,0,4,5,3,3,"",null,{"$f":"M1145*100/M1298","v":0.61538461538461542},-1,2,"",1,"",0.5,0.5,0,{"$f":"L1145*100/B$1285","v":0}]
["2020-02-28T18:00:00",19,"Sicilia",1,0,1,1,2,0,0,2,0,4,5,3,3,"",null,{"$f":"M1146*100/M1299","v":0.45045045045045046},1,"","","","",0.5,0.5,0,{"$f":"L1146*100/B$1285","v":0}]
["2020-02-29T17:00:00",19,"Sicilia",1,0,1,1,2,0,0,2,0,4,6,3,3,"",null,{"$f":"M1147*100/M1300","v":0.3546099290780142},"","","","",1,0.5,0.5,0,{"$f":"L1147*100/B$1285","v":0}]
["2020-03-01T17:00:00",19,"Sicilia",1,0,1,6,7,5,5,2,0,9,291,9,"x2",9,null,{"$f":"M1148*100/M1301","v":0.53128689492325853},5,"","",5,285,0.77777777777777779,0.22222222222222221,0,{"$f":"L1148*100/B$1285","v":0}]
["2020-03-02T18:00:00",19,"Sicilia",2,0,2,3,5,-2,-2,2,0,7,307,9,9,"",null,{"$f":"M1149*100/M1302","v":0.34381139489194501},-7,"","",-2,16,0.7142857142857143,0.2857142857142857,0,{"$f":"L1149*100/B$1285","v":0}]
["2020-03-03T18:00:00",19,"Sicilia",2,0,2,3,5,0,0,2,0,7,307,9,9,"",null,{"$f":"M1150*100/M1303","v":0.27977617905675461},2,"","","","",0.7142857142857143,0.2857142857142857,0,{"$f":"L1150*100/B$1285","v":0}]
["2020-03-04T17:00:00",19,"Sicilia",5,0,5,11,16,11,11,2,0,18,367,9,9,"",null,{"$f":"M1151*100/M1304","v":0.58271285205568146},11,"","",11,60,0.88888888888888884,0.1111111111111111,0,{"$f":"L1151*100/B$1285","v":0}]
["2020-03-05T17:00:00",19,"Sicilia",5,0,5,11,16,0,0,2,0,18,367,9,9,"",null,{"$f":"M1152*100/M1305","v":0.46656298600311041},-11,"","","","",0.88888888888888884,0.1111111111111111,0,{"$f":"L1152*100/B$1285","v":0}]
["2020-03-06T17:00:00",19,"Sicilia",7,0,7,15,22,6,6,2,0,24,367,24,"x2",24,null,{"$f":"M1153*100/M1306","v":0.51768766177739434},6,"","",6,"",0.91666666666666663,8.3333333333333329E-2,0,{"$f":"L1153*100/B$1285","v":0}]
["2020-03-07T18:00:00",19,"Sicilia",8,0,8,25,33,11,11,2,0,35,643,24,24,"",null,{"$f":"M1154*100/M1307","v":0.59493455719870814},5,"","",11,276,0.94285714285714284,5.7142857142857141E-2,0,{"$f":"L1154*100/B$1285","v":0}]
["2020-03-08T18:00:00",19,"Sicilia",18,0,18,33,51,18,18,2,0,53,791,53,"x2",53,null,{"$f":"M1155*100/M1308","v":0.71864406779661016},7,"","",18,148,0.96226415094339623,3.7735849056603772E-2,0,{"$f":"L1155*100/B$1285","v":0}]
["2020-03-09T18:00:00",19,"Sicilia",19,0,19,33,52,1,1,2,0,54,836,53,53,"",null,{"$f":"M1156*100/M1309","v":0.58874836458787616},-17,"","",1,45,0.96296296296296291,3.7037037037037035E-2,0,{"$f":"L1156*100/B$1285","v":0}]
["2020-03-10T18:00:00",19,"Sicilia",17,2,19,41,60,8,8,2,0,62,955,53,53,"",null,{"$f":"M1157*100/M1310","v":0.61089762538181103},7,"","",8,119,0.967741935483871,3.2258064516129031E-2,0,{"$f":"L1157*100/B$1285","v":0}]
["2020-03-11T17:00:00",19,"Sicilia",23,1,24,57,81,21,21,2,0,83,1194,53,53,"",null,{"$f":"M1158*100/M1311","v":0.66602471513400741},13,"","",21,239,0.97590361445783136,2.4096385542168676E-2,0,{"$f":"L1158*100/B$1285","v":0}]
["2020-03-12T17:00:00",19,"Sicilia",28,5,33,78,111,30,30,2,2,115,1477,115,"x2",115,null,{"$f":"M1159*100/M1312","v":0.7609342949778336},9,"",2,32,283,0.9652173913043478,1.7391304347826087E-2,1.7391304347826087E-2,{"$f":"L1159*100/B$1285","v":70.671378091872796}]
["2020-03-13T17:00:00",19,"Sicilia",37,7,44,82,126,15,15,2,2,130,1950,115,115,"",null,{"$f":"M1160*100/M1313","v":0.73612684031710074},-15,"","",15,473,0.96923076923076923,1.5384615384615385E-2,1.5384615384615385E-2,{"$f":"L1160*100/B$1285","v":70.671378091872796}]
["2020-03-14T17:00:00",19,"Sicilia",42,11,53,97,150,24,24,4,2,156,2100,115,115,"",null,{"$f":"M1161*100/M1314","v":0.73734461407571961},9,2,"",26,150,0.96153846153846156,2.564102564102564E-2,1.282051282051282E-2,{"$f":"L1161*100/B$1285","v":70.671378091872796}]
["2020-03-15T17:00:00",19,"Sicilia",56,15,71,108,179,29,29,7,2,188,2452,115,115,"",null,{"$f":"M1162*100/M1315","v":0.7596880429951105},5,3,"",32,352,0.9521276595744681,3.7234042553191488E-2,1.0638297872340425E-2,{"$f":"L1162*100/B$1285","v":70.671378091872796}]
["2020-03-16T17:00:00",19,"Sicilia",75,20,95,108,203,24,24,8,2,213,2653,115,115,"",null,{"$f":"M1163*100/M1316","v":0.76125804145818443},-5,1,"",25,201,0.95305164319248825,3.7558685446009391E-2,9.3896713615023476E-3,{"$f":"L1163*100/B$1285","v":70.671378091872796}]
["2020-03-17T17:00:00",19,"Sicilia",86,28,114,112,226,23,23,8,3,237,2916,237,"x2",237,null,{"$f":"M1164*100/M1317","v":0.75223766901542566},-1,"",1,24,263,0.95358649789029537,3.3755274261603373E-2,1.2658227848101266E-2,{"$f":"L1164*100/B$1285","v":106.00706713780919}]
["2020-03-18T17:00:00",19,"Sicilia",100,29,129,138,267,41,41,12,3,282,3294,237,237,"",null,{"$f":"M1165*100/M1318","v":0.78962842662335841},18,4,"",45,378,0.94680851063829785,4.2553191489361701E-2,1.0638297872340425E-2,{"$f":"L1165*100/B$1285","v":106.00706713780919}]
["2020-03-19T17:00:00",19,"Sicilia",143,36,179,142,321,54,54,15,4,340,3961,237,237,"",null,{"$f":"M1166*100/M1319","v":0.82856098452540516},13,3,1,58,667,0.94411764705882351,4.4117647058823532E-2,1.1764705882352941E-2,{"$f":"L1166*100/B$1285","v":141.34275618374559}]
["2020-03-20T17:00:00",19,"Sicilia",168,42,210,169,379,58,58,25,4,408,4468,237,237,"",null,{"$f":"M1167*100/M1320","v":0.86769741179473003},4,10,"",68,{"$f":"IF(N1167-N1166=0,\"\",N1167-N1166)","v":507},0.92892156862745101,6.1274509803921566E-2,9.8039215686274508E-3,{"$f":"L1167*100/B$1285","v":141.34275618374559}]
["2020-03-21T17:00:00",19,"Sicilia",206,48,254,204,458,79,79,26,6,490,4883,490,"x2",490,null,{"$f":"M1168*100/M1321","v":0.91455448131695849},21,1,2,{"$f":"IF(M1168-M1167=0,\"\",M1168-M1167)","v":82},415,0.9346938775510204,5.3061224489795916E-2,1.2244897959183673E-2,{"$f":"L1168*100/B$1285","v":212.01413427561837}]
["2020-03-22T17:00:00",19,"Sicilia",220,55,275,321,596,138,138,26,8,630,5580,490,490,"",null,{"$f":"M1169*100/M1322","v":1.0653048801109271},59,"",2,140,697,0.946031746031746,4.1269841269841269E-2,1.2698412698412698E-2,{"$f":"L1169*100/B$1285","v":282.68551236749119}]
["2020-03-23T17:00:00",19,"Sicilia",250,60,310,371,681,85,85,27,13,721,6375,490,490,"",null,{"$f":"M1170*100/M1323","v":1.1278489527116868},-53,1,5,91,795,0.9445214979195562,3.7447988904299581E-2,1.8030513176144243E-2,{"$f":"L1170*100/B$1285","v":459.36395759717311}]
["2020-03-24T17:00:00",19,"Sicilia",250,60,310,489,799,118,118,27,20,846,7170,490,490,"",null,{"$f":"M1171*100/M1324","v":1.2229675031802938},33,"",7,125,795,0.94444444444444442,3.1914893617021274E-2,2.3640661938534278E-2,{"$f":"L1171*100/B$1285","v":706.71378091872793}]
["2020-03-25T17:00:00",19,"Sicilia",259,80,339,597,936,137,137,33,25,994,8312,994,"x2",994,null,{"$f":"M1172*100/M1325","v":1.336272954588229},19,6,5,148,1142,0.94164989939637822,3.3199195171026159E-2,2.5150905432595575E-2,{"$f":"L1172*100/B$1285","v":883.39222614840992}]
["2020-03-26T17:00:00",19,"Sicilia",346,68,414,681,1095,159,159,36,33,1164,9658,994,994,"",null,{"$f":"M1173*100/M1326","v":1.4452625436124114},22,3,8,170,{"$f":"IF(N1173-N1172=0,\"\",N1173-N1172)","v":1346},0.94072164948453607,3.0927835051546393E-2,2.8350515463917526E-2,{"$f":"L1173*100/B$1285","v":1166.077738515901}]
["2020-03-27T17:00:00",19,"Sicilia",425,75,500,658,1158,63,86,53,39,1250,11079,{"$f":"IF(P1174=\"x2\",M1174,O1173)","v":994},{"$f":"IF(M1174>O1173*2,\"x2\",O1173)","v":994},{"$f":"IF(P1174=\"x2\",M1174,\"\")","v":""},null,{"$f":"M1174*100/M1327","v":1.4451201183842401},{"$f":"IF(J1174-J1173=0,\"\",J1174-J1173)","v":-73},17,6,86,1421,0.9264,4.24E-2,3.1199999999999999E-2,{"$f":"L1174*100/B$1285","v":1378.0918727915193}]
["2020-03-28T17:00:00",19,"Sicilia",441,71,512,730,1242,84,109,60,57,1359,13096,994,994,"",null,{"$f":"M1175*100/M1328","v":1.4696340513885284},23,7,18,109,2017,0.91390728476821192,4.4150110375275942E-2,4.194260485651214E-2,{"$f":"L1175*100/B$1285","v":2014.1342756183744}]
["2020-03-29T17:00:00",19,"Sicilia",451,71,522,808,1330,88,101,65,65,1460,13814,994,994,"",null,{"$f":"M1176*100/M1329","v":1.4945387914708923},-8,5,8,101,718,0.91095890410958902,4.4520547945205477E-2,4.4520547945205477E-2,{"$f":"L1176*100/B$1285","v":2296.8197879858658}]
["2020-03-30T17:00:00",19,"Sicilia",484,75,559,849,1408,78,95,71,76,1555,14758,994,994,"",null,{"$f":"M1177*100/M1330","v":1.5284207629326021},-6,6,11,95,944,0.90546623794212222,4.5659163987138263E-2,4.8874598070739551E-2,{"$f":"L1177*100/B$1285","v":2685.5123674911661}]
["2020-03-31T17:00:00",19,"Sicilia",503,72,575,917,1492,84,92,74,81,1647,15634,994,994,"",null,{"$f":"M1178*100/M1331","v":1.5568284936479129},-3,3,5,92,876,0.9058894960534305,4.4930176077717064E-2,4.9180327868852458E-2,{"$f":"L1178*100/B$1285","v":2862.190812720848}]
["2020-04-01T17:00:00",19,"Sicilia",496,72,568,976,1544,52,71,86,88,1718,16836,994,994,"",null,{"$f":"M1179*100/M1332","v":1.5537106372203231},-21,12,7,71,{"$f":"IF(N1179-N1178=0,\"\",N1179-N1178)","v":1202},{"$f":"IF(M1179=0,0,H1179/M1179)","v":0.89871944121071012},{"$f":"IF(M1179=0,0,K1179/M1179)","v":5.0058207217694994E-2},{"$f":"IF(M1179=0,0,L1179/M1179)","v":5.1222351571594875E-2},{"$f":"L1179*100/B$1285","v":3109.5406360424026}]
["2020-04-02T17:00:00",19,"Sicilia",503,73,576,1030,1606,62,73,92,93,1791,17833,{"$f":"IF(P1180=\"x2\",M1180,O1179)","v":994},{"$f":"IF(M1180>O1179*2,\"x2\",O1179)","v":994},{"$f":"IF(P1180=\"x2\",M1180,\"\")","v":""},null,{"$f":"M1180*100/M1333","v":1.5541208934242725},{"$f":"IF(J1180-J1179=0,\"\",J1180-J1179)","v":2},{"$f":"IF(K1180-K1179=0,\"\",K1180-K1179)","v":6},{"$f":"IF(L1180-L1179=0,\"\",L1180-L1179)","v":5},{"$f":"IF(M1180-M1179=0,\"\",M1180-M1179)","v":73},997,0.89670575097710781,5.13679508654383E-2,5.1926298157453935E-2,{"$f":"L1180*100/B$1285","v":3286.2190812720846}]
["2020-04-03T17:00:00",19,"Sicilia",535,73,608,1056,1664,58,68,94,101,1859,18686,{"$f":"IF(P1181=\"x2\",M1181,O1180)","v":994},{"$f":"IF(M1181>O1180*2,\"x2\",O1180)","v":994},{"$f":"IF(P1181=\"x2\",M1181,\"\")","v":""},null,{"$f":"M1181*100/M1334","v":1.5514032730519833},{"$f":"IF(J1181-J1180=0,\"\",J1181-J1180)","v":-5},{"$f":"IF(K1181-K1180=0,\"\",K1181-K1180)","v":2},{"$f":"IF(L1181-L1180=0,\"\",L1181-L1180)","v":8},{"$f":"IF(M1181-M1180=0,\"\",M1181-M1180)","v":68},853,0.8951048951048951,5.0564819795589029E-2,5.4330285099515867E-2,{"$f":"L1181*100/B$1285","v":3568.904593639576}]
["2020-04-04T17:00:00",19,"Sicilia",553,74,627,1099,1726,62,73,95,111,1932,19896,{"$f":"IF(P1182=\"x2\",M1182,O1181)","v":994},{"$f":"IF(M1182>O1181*2,\"x2\",O1181)","v":994},{"$f":"IF(P1182=\"x2\",M1182,\"\")","v":""},null,{"$f":"M1182*100/M1335","v":1.5501636818794531},{"$f":"IF(J1182-J1181=0,\"\",J1182-J1181)","v":5},{"$f":"IF(K1182-K1181=0,\"\",K1182-K1181)","v":1},{"$f":"IF(L1182-L1181=0,\"\",L1182-L1181)","v":10},{"$f":"IF(M1182-M1181=0,\"\",M1182-M1181)","v":73},1210,0.89337474120082816,4.917184265010352E-2,5.745341614906832E-2,{"$f":"L1182*100/B$1285","v":3922.2614840989399}]
["2020-04-05T17:00:00",19,"Sicilia",556,76,632,1142,1774,48,62,104,116,1994,21904,{"$f":"IF(P1183=\"x2\",M1183,O1182)","v":1994},{"$f":"IF(M1183>O1182*2,\"x2\",O1182)","v":"x2"},{"$f":"IF(P1183=\"x2\",M1183,\"\")","v":1994},null,{"$f":"M1183*100/M1336","v":1.5463597729317244},{"$f":"IF(J1183-J1182=0,\"\",J1183-J1182)","v":-11},{"$f":"IF(K1183-K1182=0,\"\",K1183-K1182)","v":9},{"$f":"IF(L1183-L1182=0,\"\",L1183-L1182)","v":5},{"$f":"IF(M1183-M1182=0,\"\",M1183-M1182)","v":62},2008,0.88966900702106322,5.2156469408224673E-2,5.8174523570712136E-2,{"$f":"L1183*100/B$1285","v":4098.9399293286215}]
["2020-04-06T17:00:00",19,"Sicilia",563,74,637,1178,1815,41,52,108,123,2046,23464,{"$f":"IF(P1184=\"x2\",M1184,O1183)","v":1994},{"$f":"IF(M1184>O1183*2,\"x2\",O1183)","v":1994},{"$f":"IF(P1184=\"x2\",M1184,\"\")","v":""},null,{"$f":"M1184*100/M1337","v":1.543603401057738},{"$f":"IF(J1184-J1183=0,\"\",J1184-J1183)","v":-10},{"$f":"IF(K1184-K1183=0,\"\",K1184-K1183)","v":4},{"$f":"IF(L1184-L1183=0,\"\",L1184-L1183)","v":7},{"$f":"IF(M1184-M1183=0,\"\",M1184-M1183)","v":52},1560,0.88709677419354838,5.2785923753665691E-2,6.0117302052785926E-2,{"$f":"L1184*100/B$1285","v":4346.2897526501765}]
["2020-04-07T17:00:00",19,"Sicilia",562,73,635,1224,1859,44,51,113,125,2097,24857,{"$f":"IF(P1185=\"x2\",M1185,O1184)","v":1994},{"$f":"IF(M1185>O1184*2,\"x2\",O1184)","v":1994},{"$f":"IF(P1185=\"x2\",M1185,\"\")","v":""},null,{"$f":"M1185*100/M1338","v":1.5466198575074124},{"$f":"IF(J1185-J1184=0,\"\",J1185-J1184)","v":-1},{"$f":"IF(K1185-K1184=0,\"\",K1185-K1184)","v":5},{"$f":"IF(L1185-L1184=0,\"\",L1185-L1184)","v":2},{"$f":"IF(M1185-M1184=0,\"\",M1185-M1184)","v":51},{"$f":"IF(N1185-N1184=0,\"\",N1185-N1184)","v":1393},{"$f":"IF(M1185=0,0,H1185/M1185)","v":0.88650453028135434},{"$f":"IF(M1185=0,0,K1185/M1185)","v":5.3886504530281355E-2},{"$f":"IF(M1185=0,0,L1185/M1185)","v":5.9608965188364331E-2},{"$f":"L1185*100/B$1285","v":4416.9611307420491}]
["2020-04-08T17:00:00",19,"Sicilia",563,65,628,1265,1893,34,62,133,133,2159,27438,{"$f":"IF(P1186=\"x2\",M1186,O1185)","v":1994},{"$f":"IF(M1186>O1185*2,\"x2\",O1185)","v":1994},{"$f":"IF(P1186=\"x2\",M1186,\"\")","v":""},null,{"$f":"M1186*100/M1339","v":1.5485360990374546},{"$f":"IF(J1186-J1185=0,\"\",J1186-J1185)","v":11},{"$f":"IF(K1186-K1185=0,\"\",K1186-K1185)","v":20},{"$f":"IF(L1186-L1185=0,\"\",L1186-L1185)","v":8},{"$f":"IF(M1186-M1185=0,\"\",M1186-M1185)","v":62},{"$f":"IF(N1186-N1185=0,\"\",N1186-N1185)","v":2581},{"$f":"IF(M1186=0,0,H1186/M1186)","v":0.87679481241315427},{"$f":"IF(M1186=0,0,K1186/M1186)","v":6.160259379342288E-2},{"$f":"IF(M1186=0,0,L1186/M1186)","v":6.160259379342288E-2},{"$f":"L1186*100/B$1285","v":4699.6466431095405}]
["2020-04-09T17:00:00",19,"Sicilia",566,63,629,1313,1942,49,73,152,138,2232,28742,{"$f":"IF(P1187=\"x2\",M1187,O1186)","v":1994},{"$f":"IF(M1187>O1186*2,\"x2\",O1186)","v":1994},{"$f":"IF(P1187=\"x2\",M1187,\"\")","v":""},null,{"$f":"M1187*100/M1340","v":1.5540361772938047},{"$f":"IF(J1187-J1186=0,\"\",J1187-J1186)","v":11},{"$f":"IF(K1187-K1186=0,\"\",K1187-K1186)","v":19},{"$f":"IF(L1187-L1186=0,\"\",L1187-L1186)","v":5},{"$f":"IF(M1187-M1186=0,\"\",M1187-M1186)","v":73},{"$f":"IF(N1187-N1186=0,\"\",N1187-N1186)","v":1304},{"$f":"IF(M1187=0,0,H1187/M1187)","v":0.87007168458781359},{"$f":"IF(M1187=0,0,K1187/M1187)","v":6.8100358422939072E-2},{"$f":"IF(M1187=0,0,L1187/M1187)","v":6.1827956989247312E-2},{"$f":"L1187*100/B$1285","v":4876.3250883392229}]
["2020-04-10T17:00:00",19,"Sicilia",568,62,630,1337,1967,25,70,187,148,2302,31156,{"$f":"IF(P1188=\"x2\",M1188,O1187)","v":1994},{"$f":"IF(M1188>O1187*2,\"x2\",O1187)","v":1994},{"$f":"IF(P1188=\"x2\",M1188,\"\")","v":""},null,{"$f":"M1188*100/M1341","v":1.5598636643921477},{"$f":"IF(J1188-J1187=0,\"\",J1188-J1187)","v":-3},{"$f":"IF(K1188-K1187=0,\"\",K1188-K1187)","v":35},{"$f":"IF(L1188-L1187=0,\"\",L1188-L1187)","v":10},{"$f":"IF(M1188-M1187=0,\"\",M1188-M1187)","v":70},{"$f":"IF(N1188-N1187=0,\"\",N1188-N1187)","v":2414},{"$f":"IF(M1188=0,0,H1188/M1188)","v":0.85447437011294525},{"$f":"IF(M1188=0,0,K1188/M1188)","v":8.1233709817549959E-2},{"$f":"IF(M1188=0,0,L1188/M1188)","v":6.4291920069504779E-2},{"$f":"L1188*100/B$1285","v":5229.681978798586}]
["2020-04-11T17:00:00",19,"Sicilia",562,58,620,1381,2001,34,62,209,154,2364,33787,{"$f":"IF(P1189=\"x2\",M1189,O1188)","v":1994},{"$f":"IF(M1189>O1188*2,\"x2\",O1188)","v":1994},{"$f":"IF(P1189=\"x2\",M1189,\"\")","v":""},null,{"$f":"M1189*100/M1342","v":1.5524952223338653},{"$f":"IF(J1189-J1188=0,\"\",J1189-J1188)","v":-8},{"$f":"IF(K1189-K1188=0,\"\",K1189-K1188)","v":22},{"$f":"IF(L1189-L1188=0,\"\",L1189-L1188)","v":6},{"$f":"IF(M1189-M1188=0,\"\",M1189-M1188)","v":62},{"$f":"IF(N1189-N1188=0,\"\",N1189-N1188)","v":2631},{"$f":"IF(M1189=0,0,H1189/M1189)","v":0.84644670050761417},{"$f":"IF(M1189=0,0,K1189/M1189)","v":8.8409475465313025E-2},{"$f":"IF(M1189=0,0,L1189/M1189)","v":6.5143824027072764E-2},{"$f":"L1189*100/B$1285","v":5441.6961130742047}]
["2020-04-12T17:00:00",19,"Sicilia",552,53,605,1425,2030,29,52,223,163,2416,36098,{"$f":"IF(P1190=\"x2\",M1190,O1189)","v":1994},{"$f":"IF(M1190>O1189*2,\"x2\",O1189)","v":1994},{"$f":"IF(P1190=\"x2\",M1190,\"\")","v":""},null,{"$f":"M1190*100/M1343","v":1.5451225673592857},{"$f":"IF(J1190-J1189=0,\"\",J1190-J1189)","v":-10},{"$f":"IF(K1190-K1189=0,\"\",K1190-K1189)","v":14},{"$f":"IF(L1190-L1189=0,\"\",L1190-L1189)","v":9},{"$f":"IF(M1190-M1189=0,\"\",M1190-M1189)","v":52},{"$f":"IF(N1190-N1189=0,\"\",N1190-N1189)","v":2311},{"$f":"IF(M1190=0,0,H1190/M1190)","v":0.84023178807947019},{"$f":"IF(M1190=0,0,K1190/M1190)","v":9.2301324503311258E-2},{"$f":"IF(M1190=0,0,L1190/M1190)","v":6.7466887417218541E-2},{"$f":"L1190*100/B$1285","v":5759.7173144876324}]
["2020-04-13T17:00:00",19,"Sicilia",554,51,605,1445,2050,20,42,237,171,2458,37311,{"$f":"IF(P1191=\"x2\",M1191,O1190)","v":1994},{"$f":"IF(M1191>O1190*2,\"x2\",O1190)","v":1994},{"$f":"IF(P1191=\"x2\",M1191,\"\")","v":""},null,{"$f":"M1191*100/M1344","v":1.540911256551067},{"$f":"IF(J1191-J1190=0,\"\",J1191-J1190)","v":-10},{"$f":"IF(K1191-K1190=0,\"\",K1191-K1190)","v":14},{"$f":"IF(L1191-L1190=0,\"\",L1191-L1190)","v":8},{"$f":"IF(M1191-M1190=0,\"\",M1191-M1190)","v":42},{"$f":"IF(N1191-N1190=0,\"\",N1191-N1190)","v":1213},{"$f":"IF(M1191=0,0,H1191/M1191)","v":0.83401139137510172},{"$f":"IF(M1191=0,0,K1191/M1191)","v":9.6419853539462974E-2},{"$f":"IF(M1191=0,0,L1191/M1191)","v":6.9568755085435308E-2},{"$f":"L1191*100/B$1285","v":6042.4028268551237}]
["2020-04-14T17:00:00",19,"Sicilia",552,53,605,1466,2071,21,43,255,175,2501,37877,{"$f":"IF(P1192=\"x2\",M1192,O1191)","v":1994},{"$f":"IF(M1192>O1191*2,\"x2\",O1191)","v":1994},{"$f":"IF(P1192=\"x2\",M1192,\"\")","v":""},null,{"$f":"M1192*100/M1345","v":1.5391905863817636},{"$f":"IF(J1192-J1191=0,\"\",J1192-J1191)","v":1},{"$f":"IF(K1192-K1191=0,\"\",K1192-K1191)","v":18},{"$f":"IF(L1192-L1191=0,\"\",L1192-L1191)","v":4},{"$f":"IF(M1192-M1191=0,\"\",M1192-M1191)","v":43},{"$f":"IF(N1192-N1191=0,\"\",N1192-N1191)","v":566},{"$f":"IF(M1192=0,0,H1192/M1192)","v":0.82806877249100364},{"$f":"IF(M1192=0,0,K1192/M1192)","v":0.10195921631347461},{"$f":"IF(M1192=0,0,L1192/M1192)","v":6.9972011195521794E-2},{"$f":"L1192*100/B$1285","v":6183.745583038869}]
["2020-04-15T17:00:00",19,"Sicilia",541,49,590,1491,2081,10,34,273,181,2535,39867,{"$f":"IF(P1193=\"x2\",M1193,O1192)","v":1994},{"$f":"IF(M1193>O1192*2,\"x2\",O1192)","v":1994},{"$f":"IF(P1193=\"x2\",M1193,\"\")","v":""},null,{"$f":"M1193*100/M1346","v":1.5349217401834641},{"$f":"IF(J1193-J1192=0,\"\",J1193-J1192)","v":-9},{"$f":"IF(K1193-K1192=0,\"\",K1193-K1192)","v":18},{"$f":"IF(L1193-L1192=0,\"\",L1193-L1192)","v":6},{"$f":"IF(M1193-M1192=0,\"\",M1193-M1192)","v":34},{"$f":"IF(N1193-N1192=0,\"\",N1193-N1192)","v":1990},{"$f":"IF(M1193=0,0,H1193/M1193)","v":0.82090729783037475},{"$f":"IF(M1193=0,0,K1193/M1193)","v":0.1076923076923077},{"$f":"IF(M1193=0,0,L1193/M1193)","v":7.1400394477317553E-2},{"$f":"L1193*100/B$1285","v":6395.7597173144877}]
[{"$f":"A1193 + 1","v":"2020-04-16T17:00:00"},null,null,null,null,null,null,null,null,null,null,null,null,null,null,"Media x2",{"$f":"COUNT(M1142:M1193) / COUNT(Q1142:Q1193)","v":5.2}]
[{"$f":"A1194+1","v":"2020-04-17T17:00:00"}]
[{"$f":"A1195+1","v":"2020-04-18T17:00:00"}]
[null,null,null,null,{"$f":"E1193/$M1193","v":1.9329388560157791E-2},null,null,{"$f":"H1193/$M1193","v":0.82090729783037475},null,null,{"$f":"K1193/$M1193","v":0.1076923076923077},{"$f":"L1193/$M1193","v":7.1400394477317553E-2},null,{"$f":"N1193/$M1193","v":15.726627218934912}]
[]
[]
[]
["Data","Codice","Regione","Ricoverati","Terap. Intens.","Ospedalizzati","Quarantena","Positivi","+ Positivi","Nuovi","Guariti","Deceduti","Totale","Tamponi",null,null,"x 2",null,"% su Tot.","+ Nuovi","+ Guariti","+ Deceduti","+ Totali","+ Tamponi","% Positivi","% Guariti","% Deceduti","P. Stimati"]
["2020-02-24T18:00:00",20,"Sardegna",0,0,0,0,0,0,0,0,0,0,1,{"$f":"M1202","v":0},null,{"$f":"M1202","v":0},null,{"$f":"M1202*100/M1295","v":0},null,null,null,null,null,{"$f":"IF(M1202=0,0,H1202/M1202)","v":0},{"$f":"IF(M1202=0,0,K1202/M1202)","v":0},{"$f":"IF(M1202=0,0,L1202/M1202)","v":0},{"$f":"L1202*100/B$1285","v":0}]
["2020-02-25T18:00:00",20,"Sardegna",0,0,0,0,0,0,0,0,0,0,1,{"$f":"IF(P1203=\"x2\",M1203,O1202)","v":0},{"$f":"IF(M1203>O1202*2,\"x2\",O1202)","v":0},{"$f":"IF(P1203=\"x2\",M1203,\"\")","v":""},null,{"$f":"M1203*100/M1296","v":0},{"$f":"IF(J1203-J1202=0,\"\",J1203-J1202)","v":""},{"$f":"IF(K1203-K1202=0,\"\",K1203-K1202)","v":""},{"$f":"IF(L1203-L1202=0,\"\",L1203-L1202)","v":""},{"$f":"IF(M1203-M1202=0,\"\",M1203-M1202)","v":""},{"$f":"IF(N1203-N1202=0,\"\",N1203-N1202)","v":""},0,0,0,0]
["2020-02-26T18:00:00",20,"Sardegna",0,0,0,0,0,0,0,0,0,0,1,0,0,"",null,{"$f":"M1204*100/M1297","v":0},"","","","","",0,0,0,0]
["2020-02-27T18:00:00",20,"Sardegna",0,0,0,0,0,0,0,0,0,0,1,0,0,"",null,{"$f":"M1205*100/M1298","v":0},"","","","","",0,0,0,0]
["2020-02-28T18:00:00",20,"Sardegna",0,0,0,0,0,0,0,0,0,0,1,0,0,"",null,{"$f":"M1206*100/M1299","v":0},"","","","","",0,0,0,0]
["2020-02-29T17:00:00",20,"Sardegna",0,0,0,0,0,0,0,0,0,0,1,0,0,"",null,{"$f":"M1207*100/M1300","v":0},"","","","","",0,0,0,0]
["2020-03-01T17:00:00",20,"Sardegna",0,0,0,0,0,0,0,0,0,0,29,0,0,"",null,{"$f":"M1208*100/M1301","v":0},"","","","",28,0,0,0,0]
["2020-03-02T18:00:00",20,"Sardegna",0,0,0,0,0,0,0,0,0,0,29,0,0,"",null,{"$f":"M1209*100/M1302","v":0},"","","","","",0,0,0,0]
["2020-03-03T18:00:00",20,"Sardegna",1,0,1,0,1,1,1,0,0,1,29,1,"x2",1,null,{"$f":"M1210*100/M1303","v":3.9968025579536368E-2},1,"","",1,"",1,0,0,0]
["2020-03-04T17:00:00",20,"Sardegna",1,0,1,1,2,1,1,0,0,2,42,1,1,"",null,{"$f":"M1211*100/M1304","v":6.4745872450631278E-2},"","","",1,13,1,0,0,0]
["2020-03-05T17:00:00",20,"Sardegna",2,0,2,0,2,0,0,0,0,2,50,1,1,"",null,{"$f":"M1212*100/M1305","v":5.1840331778123382E-2},-1,"","","",8,1,0,0,0]
["2020-03-06T17:00:00",20,"Sardegna",2,0,2,3,5,3,3,0,0,5,99,5,"x2",5,null,{"$f":"M1213*100/M1306","v":0.10785159620362382},3,"","",3,49,1,0,0,0]
["2020-03-07T18:00:00",20,"Sardegna",2,0,2,3,5,0,0,0,0,5,99,5,5,"",null,{"$f":"M1214*100/M1307","v":8.4990651028386877E-2},-3,"","","","",1,0,0,0]
["2020-03-08T18:00:00",20,"Sardegna",5,0,5,6,11,6,6,0,0,11,149,11,"x2",11,null,{"$f":"M1215*100/M1308","v":0.14915254237288136},6,"","",6,50,1,0,0,0]
["2020-03-09T18:00:00",20,"Sardegna",8,0,8,11,19,8,8,0,0,19,185,11,11,"",null,{"$f":"M1216*100/M1309","v":0.20715220235499346},2,"","",8,36,1,0,0,0]
["2020-03-10T18:00:00",20,"Sardegna",9,0,9,11,20,1,1,0,0,20,204,11,11,"",null,{"$f":"M1217*100/M1310","v":0.19706375012316485},-7,"","",1,19,1,0,0,0]
["2020-03-11T17:00:00",20,"Sardegna",10,0,10,27,37,17,17,0,0,37,283,37,"x2",37,null,{"$f":"M1218*100/M1311","v":0.29690258385491897},16,"","",17,79,1,0,0,0]
["2020-03-12T17:00:00",20,"Sardegna",12,0,12,27,39,2,2,0,0,39,302,37,37,"",null,{"$f":"M1219*100/M1312","v":0.25805597829683052},-15,"","",2,19,1,0,0,0]
["2020-03-13T17:00:00",20,"Sardegna",12,0,12,31,43,4,4,0,0,43,504,37,37,"",null,{"$f":"M1220*100/M1313","v":0.2434881087202718},2,"","",4,202,1,0,0,0]
["2020-03-14T17:00:00",20,"Sardegna",14,0,14,33,47,4,4,0,0,47,530,37,37,"",null,{"$f":"M1221*100/M1314","v":0.22214869783050528},"","","",4,26,1,0,0,0]
["2020-03-15T17:00:00",20,"Sardegna",16,0,16,59,75,28,28,0,2,77,613,77,"x2",77,null,{"$f":"M1222*100/M1315","v":0.31114882612033784},24,"",2,30,83,0.97402597402597402,0,2.5974025974025976E-2,70.671378091872796]
["2020-03-16T17:00:00",20,"Sardegna",39,0,39,66,105,30,30,0,2,107,797,77,77,"",null,{"$f":"M1223*100/M1316","v":0.38241601143674053},2,"","",30,184,0.98130841121495327,0,1.8691588785046728E-2,70.671378091872796]
["2020-03-17T17:00:00",20,"Sardegna",36,4,40,75,115,10,10,0,2,117,1003,77,77,"",null,{"$f":"M1224*100/M1317","v":0.37135783660255189},-20,"","",10,206,0.98290598290598286,0,1.7094017094017096E-2,70.671378091872796]
["2020-03-18T17:00:00",20,"Sardegna",42,7,49,83,132,17,17,0,2,134,1135,77,77,"",null,{"$f":"M1225*100/M1318","v":0.3752135076862767},7,"","",17,132,0.9850746268656716,0,1.4925373134328358E-2,70.671378091872796]
["2020-03-19T17:00:00",20,"Sardegna",43,9,52,152,204,72,72,0,2,206,1334,206,"x2",206,null,{"$f":"M1226*100/M1319","v":0.50201047885951022},55,"","",72,199,0.99029126213592233,0,9.7087378640776691E-3,70.671378091872796]
["2020-03-20T17:00:00",20,"Sardegna",56,15,71,217,288,84,84,3,2,293,1912,206,206,"",null,{"$f":"M1227*100/M1320","v":0.62312583739180372},12,3,"",87,{"$f":"IF(N1227-N1226=0,\"\",N1227-N1226)","v":578},0.98293515358361772,1.0238907849829351E-2,6.8259385665529011E-3,70.671378091872796]
["2020-03-21T17:00:00",20,"Sardegna",65,16,81,240,321,33,33,5,4,330,2297,206,206,"",null,{"$f":"M1228*100/M1321","v":0.61592444660121692},-51,2,2,{"$f":"IF(M1228-M1227=0,\"\",M1228-M1227)","v":37},385,0.97272727272727277,1.5151515151515152E-2,1.2121212121212121E-2,141.34275618374559]
["2020-03-22T17:00:00",20,"Sardegna",67,16,83,244,327,6,6,5,7,339,2402,206,206,"",null,{"$f":"M1229*100/M1322","v":0.57323548310730832},-27,"",3,9,105,0.96460176991150437,1.4749262536873156E-2,2.0648967551622419E-2,247.34982332155477]
["2020-03-23T17:00:00",20,"Sardegna",76,18,94,249,343,16,16,5,11,359,2568,206,206,"",null,{"$f":"M1230*100/M1323","v":0.56157804996323935},10,"",4,20,166,0.95543175487465182,1.3927576601671309E-2,3.0640668523676879E-2,388.69257950530033]
["2020-03-24T17:00:00",20,"Sardegna",80,19,99,296,395,52,52,11,15,421,2859,421,"x2",421,null,{"$f":"M1231*100/M1324","v":0.60859257545969703},36,6,4,62,291,0.93824228028503565,2.6128266033254157E-2,3.5629453681710214E-2,530.03533568904595]
["2020-03-25T17:00:00",20,"Sardegna",82,19,101,311,412,17,17,12,18,442,3019,421,421,"",null,{"$f":"M1232*100/M1325","v":0.59419783292555051},-35,1,3,21,160,0.9321266968325792,2.7149321266968326E-2,4.072398190045249E-2,636.0424028268551]
["2020-03-26T17:00:00",20,"Sardegna",92,20,112,350,462,50,50,13,19,494,3461,421,421,"",null,{"$f":"M1233*100/M1326","v":0.61336743689392714},33,1,1,52,{"$f":"IF(N1233-N1232=0,\"\",N1233-N1232)","v":442},0.93522267206477738,2.6315789473684209E-2,3.8461538461538464E-2,671.37809187279152]
["2020-03-27T17:00:00",20,"Sardegna",93,19,112,384,496,34,36,13,21,530,3801,{"$f":"IF(P1234=\"x2\",M1234,O1233)","v":421},{"$f":"IF(M1234>O1233*2,\"x2\",O1233)","v":421},{"$f":"IF(P1234=\"x2\",M1234,\"\")","v":""},null,{"$f":"M1234*100/M1327","v":0.61273093019491776},{"$f":"IF(J1234-J1233=0,\"\",J1234-J1233)","v":-14},"",2,36,340,0.9358490566037736,2.4528301886792454E-2,3.962264150943396E-2,742.04946996466424]
["2020-03-28T17:00:00",20,"Sardegna",95,22,117,452,569,73,94,29,26,624,4225,421,421,"",null,{"$f":"M1235*100/M1328","v":0.67479885803270179},58,16,5,94,424,0.91185897435897434,4.6474358974358976E-2,4.1666666666666664E-2,918.72791519434622]
["2020-03-29T17:00:00",20,"Sardegna",105,23,128,454,582,13,14,29,27,638,4598,421,421,"",null,{"$f":"M1236*100/M1329","v":0.65309297873865024},-80,"",1,14,373,0.91222570532915359,4.5454545454545456E-2,4.2319749216300939E-2,954.06360424028264]
["2020-03-30T17:00:00",20,"Sardegna",113,24,137,485,622,40,44,32,28,682,4993,421,421,"",null,{"$f":"M1237*100/M1330","v":0.67034273975564929},30,3,1,44,395,0.91202346041055715,4.6920821114369501E-2,4.1055718475073312E-2,989.39929328621906]
["2020-03-31T17:00:00",20,"Sardegna",113,28,141,516,657,35,40,34,31,722,5257,421,421,"",null,{"$f":"M1238*100/M1331","v":0.68247126436781613},-4,2,3,40,264,0.90997229916897504,4.7091412742382273E-2,4.2936288088642659E-2,1095.4063604240282]
["2020-04-01T17:00:00",20,"Sardegna",119,27,146,529,675,18,23,36,34,745,5501,421,421,"",null,{"$f":"M1239*100/M1332","v":0.6737569410530504},-17,2,3,23,{"$f":"IF(N1239-N1238=0,\"\",N1239-N1238)","v":244},{"$f":"IF(M1239=0,0,H1239/M1239)","v":0.90604026845637586},{"$f":"IF(M1239=0,0,K1239/M1239)","v":4.832214765100671E-2},{"$f":"IF(M1239=0,0,L1239/M1239)","v":4.5637583892617448E-2},1201.4134275618374]
["2020-04-02T17:00:00",20,"Sardegna",117,24,141,577,718,43,49,36,40,794,5970,{"$f":"IF(P1240=\"x2\",M1240,O1239)","v":421},{"$f":"IF(M1240>O1239*2,\"x2\",O1239)","v":421},{"$f":"IF(P1240=\"x2\",M1240,\"\")","v":""},null,{"$f":"M1240*100/M1333","v":0.68898491869283773},{"$f":"IF(J1240-J1239=0,\"\",J1240-J1239)","v":26},{"$f":"IF(K1240-K1239=0,\"\",K1240-K1239)","v":""},{"$f":"IF(L1240-L1239=0,\"\",L1240-L1239)","v":6},{"$f":"IF(M1240-M1239=0,\"\",M1240-M1239)","v":49},469,0.90428211586901763,4.534005037783375E-2,5.0377833753148617E-2,1413.4275618374559]
["2020-04-03T17:00:00",20,"Sardegna",122,24,146,598,744,26,31,40,41,825,6478,{"$f":"IF(P1241=\"x2\",M1241,O1240)","v":421},{"$f":"IF(M1241>O1240*2,\"x2\",O1240)","v":421},{"$f":"IF(P1241=\"x2\",M1241,\"\")","v":""},null,{"$f":"M1241*100/M1334","v":0.6884925767982174},{"$f":"IF(J1241-J1240=0,\"\",J1241-J1240)","v":-18},{"$f":"IF(K1241-K1240=0,\"\",K1241-K1240)","v":4},{"$f":"IF(L1241-L1240=0,\"\",L1241-L1240)","v":1},{"$f":"IF(M1241-M1240=0,\"\",M1241-M1240)","v":31},508,0.90181818181818185,4.8484848484848485E-2,4.9696969696969698E-2,{"$f":"L1241*100/B$1285","v":1448.7632508833922}]
["2020-04-04T17:00:00",20,"Sardegna",123,24,147,642,789,45,49,44,41,874,6789,{"$f":"IF(P1242=\"x2\",M1242,O1241)","v":874},{"$f":"IF(M1242>O1241*2,\"x2\",O1241)","v":"x2"},{"$f":"IF(P1242=\"x2\",M1242,\"\")","v":874},null,{"$f":"M1242*100/M1335","v":0.70126452275499074},{"$f":"IF(J1242-J1241=0,\"\",J1242-J1241)","v":18},{"$f":"IF(K1242-K1241=0,\"\",K1242-K1241)","v":4},{"$f":"IF(L1242-L1241=0,\"\",L1242-L1241)","v":""},{"$f":"IF(M1242-M1241=0,\"\",M1242-M1241)","v":49},311,0.902745995423341,5.0343249427917618E-2,4.691075514874142E-2,{"$f":"L1242*100/B$1285","v":1448.7632508833922}]
["2020-04-05T17:00:00",20,"Sardegna",126,25,151,664,815,26,33,49,43,907,7157,{"$f":"IF(P1243=\"x2\",M1243,O1242)","v":874},{"$f":"IF(M1243>O1242*2,\"x2\",O1242)","v":874},{"$f":"IF(P1243=\"x2\",M1243,\"\")","v":""},null,{"$f":"M1243*100/M1336","v":0.70338430995440027},{"$f":"IF(J1243-J1242=0,\"\",J1243-J1242)","v":-16},{"$f":"IF(K1243-K1242=0,\"\",K1243-K1242)","v":5},{"$f":"IF(L1243-L1242=0,\"\",L1243-L1242)","v":2},{"$f":"IF(M1243-M1242=0,\"\",M1243-M1242)","v":33},368,0.89856670341786105,5.4024255788313123E-2,4.7409040793825796E-2,{"$f":"L1243*100/B$1285","v":1519.434628975265}]
["2020-04-06T17:00:00",20,"Sardegna",123,26,149,670,819,4,15,56,47,922,7521,{"$f":"IF(P1244=\"x2\",M1244,O1243)","v":874},{"$f":"IF(M1244>O1243*2,\"x2\",O1243)","v":874},{"$f":"IF(P1244=\"x2\",M1244,\"\")","v":""},null,{"$f":"M1244*100/M1337","v":0.69560231465065225},{"$f":"IF(J1244-J1243=0,\"\",J1244-J1243)","v":-18},{"$f":"IF(K1244-K1243=0,\"\",K1244-K1243)","v":7},{"$f":"IF(L1244-L1243=0,\"\",L1244-L1243)","v":4},{"$f":"IF(M1244-M1243=0,\"\",M1244-M1243)","v":15},364,0.88828633405639912,6.0737527114967459E-2,5.0976138828633402E-2,{"$f":"L1244*100/B$1285","v":1660.7773851590105}]
["2020-04-07T17:00:00",20,"Sardegna",122,26,148,673,821,2,13,62,52,935,7680,{"$f":"IF(P1245=\"x2\",M1245,O1244)","v":874},{"$f":"IF(M1245>O1244*2,\"x2\",O1244)","v":874},{"$f":"IF(P1245=\"x2\",M1245,\"\")","v":""},null,{"$f":"M1245*100/M1338","v":0.68959922115852668},{"$f":"IF(J1245-J1244=0,\"\",J1245-J1244)","v":-2},{"$f":"IF(K1245-K1244=0,\"\",K1245-K1244)","v":6},{"$f":"IF(L1245-L1244=0,\"\",L1245-L1244)","v":5},{"$f":"IF(M1245-M1244=0,\"\",M1245-M1244)","v":13},{"$f":"IF(N1245-N1244=0,\"\",N1245-N1244)","v":159},{"$f":"IF(M1245=0,0,H1245/M1245)","v":0.87807486631016041},{"$f":"IF(M1245=0,0,K1245/M1245)","v":6.6310160427807491E-2},{"$f":"IF(M1245=0,0,L1245/M1245)","v":5.5614973262032089E-2},{"$f":"L1245*100/B$1285","v":1837.4558303886924}]
["2020-04-08T17:00:00",20,"Sardegna",112,31,143,697,840,19,40,76,59,975,8493,{"$f":"IF(P1246=\"x2\",M1246,O1245)","v":874},{"$f":"IF(M1246>O1245*2,\"x2\",O1245)","v":874},{"$f":"IF(P1246=\"x2\",M1246,\"\")","v":""},null,{"$f":"M1246*100/M1339","v":0.69931574643886907},{"$f":"IF(J1246-J1245=0,\"\",J1246-J1245)","v":27},{"$f":"IF(K1246-K1245=0,\"\",K1246-K1245)","v":14},{"$f":"IF(L1246-L1245=0,\"\",L1246-L1245)","v":7},{"$f":"IF(M1246-M1245=0,\"\",M1246-M1245)","v":40},{"$f":"IF(N1246-N1245=0,\"\",N1246-N1245)","v":813},{"$f":"IF(M1246=0,0,H1246/M1246)","v":0.86153846153846159},{"$f":"IF(M1246=0,0,K1246/M1246)","v":7.7948717948717952E-2},{"$f":"IF(M1246=0,0,L1246/M1246)","v":6.051282051282051E-2},{"$f":"L1246*100/B$1285","v":2084.8056537102475}]
["2020-04-09T17:00:00",20,"Sardegna",106,25,131,745,876,36,51,86,64,1026,8918,{"$f":"IF(P1247=\"x2\",M1247,O1246)","v":874},{"$f":"IF(M1247>O1246*2,\"x2\",O1246)","v":874},{"$f":"IF(P1247=\"x2\",M1247,\"\")","v":""},null,{"$f":"M1247*100/M1340","v":0.71435533956247477},{"$f":"IF(J1247-J1246=0,\"\",J1247-J1246)","v":11},{"$f":"IF(K1247-K1246=0,\"\",K1247-K1246)","v":10},{"$f":"IF(L1247-L1246=0,\"\",L1247-L1246)","v":5},{"$f":"IF(M1247-M1246=0,\"\",M1247-M1246)","v":51},{"$f":"IF(N1247-N1246=0,\"\",N1247-N1246)","v":425},{"$f":"IF(M1247=0,0,H1247/M1247)","v":0.85380116959064323},{"$f":"IF(M1247=0,0,K1247/M1247)","v":8.3820662768031184E-2},{"$f":"IF(M1247=0,0,L1247/M1247)","v":6.2378167641325533E-2},{"$f":"L1247*100/B$1285","v":2261.4840989399295}]
["2020-04-10T17:00:00",20,"Sardegna",107,26,133,743,876,0,37,118,69,1063,9444,{"$f":"IF(P1248=\"x2\",M1248,O1247)","v":874},{"$f":"IF(M1248>O1247*2,\"x2\",O1247)","v":874},{"$f":"IF(P1248=\"x2\",M1248,\"\")","v":""},null,{"$f":"M1248*100/M1341","v":0.72030194406987536},{"$f":"IF(J1248-J1247=0,\"\",J1248-J1247)","v":-14},{"$f":"IF(K1248-K1247=0,\"\",K1248-K1247)","v":32},{"$f":"IF(L1248-L1247=0,\"\",L1248-L1247)","v":5},{"$f":"IF(M1248-M1247=0,\"\",M1248-M1247)","v":37},{"$f":"IF(N1248-N1247=0,\"\",N1248-N1247)","v":526},{"$f":"IF(M1248=0,0,H1248/M1248)","v":0.82408278457196615},{"$f":"IF(M1248=0,0,K1248/M1248)","v":0.11100658513640639},{"$f":"IF(M1248=0,0,L1248/M1248)","v":6.4910630291627469E-2},{"$f":"L1248*100/B$1285","v":2438.1625441696115}]
["2020-04-11T17:00:00",20,"Sardegna",113,24,137,751,888,12,28,130,73,1091,10120,{"$f":"IF(P1249=\"x2\",M1249,O1248)","v":874},{"$f":"IF(M1249>O1248*2,\"x2\",O1248)","v":874},{"$f":"IF(P1249=\"x2\",M1249,\"\")","v":""},null,{"$f":"M1249*100/M1342","v":0.71648573924122128},{"$f":"IF(J1249-J1248=0,\"\",J1249-J1248)","v":-9},{"$f":"IF(K1249-K1248=0,\"\",K1249-K1248)","v":12},{"$f":"IF(L1249-L1248=0,\"\",L1249-L1248)","v":4},{"$f":"IF(M1249-M1248=0,\"\",M1249-M1248)","v":28},{"$f":"IF(N1249-N1248=0,\"\",N1249-N1248)","v":676},{"$f":"IF(M1249=0,0,H1249/M1249)","v":0.81393217231897341},{"$f":"IF(M1249=0,0,K1249/M1249)","v":0.11915673693858846},{"$f":"IF(M1249=0,0,L1249/M1249)","v":6.6911090742438131E-2},{"$f":"L1249*100/B$1285","v":2579.5053003533567}]
["2020-04-12T17:00:00",20,"Sardegna",109,26,135,768,903,15,22,137,73,1113,10663,{"$f":"IF(P1250=\"x2\",M1250,O1249)","v":874},{"$f":"IF(M1250>O1249*2,\"x2\",O1249)","v":874},{"$f":"IF(P1250=\"x2\",M1250,\"\")","v":""},null,{"$f":"M1250*100/M1343","v":0.71180522246311473},{"$f":"IF(J1250-J1249=0,\"\",J1250-J1249)","v":-6},{"$f":"IF(K1250-K1249=0,\"\",K1250-K1249)","v":7},{"$f":"IF(L1250-L1249=0,\"\",L1250-L1249)","v":""},{"$f":"IF(M1250-M1249=0,\"\",M1250-M1249)","v":22},{"$f":"IF(N1250-N1249=0,\"\",N1250-N1249)","v":543},{"$f":"IF(M1250=0,0,H1250/M1250)","v":0.81132075471698117},{"$f":"IF(M1250=0,0,K1250/M1250)","v":0.12309074573225516},{"$f":"IF(M1250=0,0,L1250/M1250)","v":6.5588499550763707E-2},{"$f":"L1250*100/B$1285","v":2579.5053003533567}]
["2020-04-13T17:00:00",20,"Sardegna",107,27,134,780,914,11,15,139,75,1128,11010,{"$f":"IF(P1251=\"x2\",M1251,O1250)","v":874},{"$f":"IF(M1251>O1250*2,\"x2\",O1250)","v":874},{"$f":"IF(P1251=\"x2\",M1251,\"\")","v":""},null,{"$f":"M1251*100/M1344","v":0.70713909576468814},{"$f":"IF(J1251-J1250=0,\"\",J1251-J1250)","v":-7},{"$f":"IF(K1251-K1250=0,\"\",K1251-K1250)","v":2},{"$f":"IF(L1251-L1250=0,\"\",L1251-L1250)","v":2},{"$f":"IF(M1251-M1250=0,\"\",M1251-M1250)","v":15},{"$f":"IF(N1251-N1250=0,\"\",N1251-N1250)","v":347},{"$f":"IF(M1251=0,0,H1251/M1251)","v":0.81028368794326244},{"$f":"IF(M1251=0,0,K1251/M1251)","v":0.12322695035460993},{"$f":"IF(M1251=0,0,L1251/M1251)","v":6.6489361702127658E-2},{"$f":"L1251*100/B$1285","v":2650.1766784452298}]
["2020-04-14T17:00:00",20,"Sardegna",107,24,131,769,900,-14,10,158,80,1138,11893,{"$f":"IF(P1252=\"x2\",M1252,O1251)","v":874},{"$f":"IF(M1252>O1251*2,\"x2\",O1251)","v":874},{"$f":"IF(P1252=\"x2\",M1252,\"\")","v":""},null,{"$f":"M1252*100/M1345","v":0.70035941115651612},{"$f":"IF(J1252-J1251=0,\"\",J1252-J1251)","v":-5},{"$f":"IF(K1252-K1251=0,\"\",K1252-K1251)","v":19},{"$f":"IF(L1252-L1251=0,\"\",L1252-L1251)","v":5},{"$f":"IF(M1252-M1251=0,\"\",M1252-M1251)","v":10},{"$f":"IF(N1252-N1251=0,\"\",N1252-N1251)","v":883},{"$f":"IF(M1252=0,0,H1252/M1252)","v":0.79086115992970119},{"$f":"IF(M1252=0,0,K1252/M1252)","v":0.13884007029876977},{"$f":"IF(M1252=0,0,L1252/M1252)","v":7.0298769771529004E-2},{"$f":"L1252*100/B$1285","v":2826.8551236749117}]
["2020-04-15T17:00:00",20,"Sardegna",107,26,133,737,870,-30,23,208,83,1161,12395,{"$f":"IF(P1253=\"x2\",M1253,O1252)","v":874},{"$f":"IF(M1253>O1252*2,\"x2\",O1252)","v":874},{"$f":"IF(P1253=\"x2\",M1253,\"\")","v":""},null,{"$f":"M1253*100/M1346","v":0.70297599224970486},{"$f":"IF(J1253-J1252=0,\"\",J1253-J1252)","v":13},{"$f":"IF(K1253-K1252=0,\"\",K1253-K1252)","v":50},{"$f":"IF(L1253-L1252=0,\"\",L1253-L1252)","v":3},{"$f":"IF(M1253-M1252=0,\"\",M1253-M1252)","v":23},{"$f":"IF(N1253-N1252=0,\"\",N1253-N1252)","v":502},{"$f":"IF(M1253=0,0,H1253/M1253)","v":0.74935400516795869},{"$f":"IF(M1253=0,0,K1253/M1253)","v":0.17915590008613264},{"$f":"IF(M1253=0,0,L1253/M1253)","v":7.14900947459087E-2},{"$f":"L1253*100/B$1285","v":2932.8621908127207}]
[{"$f":"A1253 + 1","v":"2020-04-16T17:00:00"},null,null,null,null,null,null,null,null,null,null,null,null,null,null,"Media x2",{"$f":"COUNT(M1202:M1253) / COUNT(Q1202:Q1253)","v":5.7777777777777777}]
[{"$f":"A1254+1","v":"2020-04-17T17:00:00"}]
[{"$f":"A1255+1","v":"2020-04-18T17:00:00"}]
[null,null,null,null,{"$f":"E1253/$M1253","v":2.2394487510766579E-2},null,null,{"$f":"H1253/$M1253","v":0.74935400516795869},null,null,{"$f":"K1253/$M1253","v":0.17915590008613264},{"$f":"L1253/$M1253","v":7.14900947459087E-2},null,{"$f":"N1253/$M1253","v":10.676141257536607}]
[]
[]
[null,"C. Tot.","Regione","Abitanti","Contagiati","Su 10.000 Abitanti",null,"C. Tot.","Regione"]
[null,{"$f":"MAX(M2:M57)","v":18229},{"$f":"C2","v":"Piemonte"},4356406,{"$f":"B1261*10000/D1261","v":41.844125639345826},{"$f":"100-E1261","v":58.155874360654174},null,{"$f":"IFERROR(SMALL(B$1261:B$1281,COUNTBLANK($G$1261:G1261)),\"\")","v":263},{"$f":"VLOOKUP(H1261,$B$1261:$C$1281,2,FALSE)","v":"Molise"}]
[null,{"$f":"MAX(M62:M116)","v":958},{"$f":"C62","v":"Valle d'Aosta"},125332,{"$f":"B1262*10000/D1262","v":76.436983372163539},{"$f":"100-E1262","v":23.563016627836461},null,{"$f":"IFERROR(SMALL(B$1261:B$1281,COUNTBLANK($G$1261:G1262)),\"\")","v":320},"Basilicata"]
[null,{"$f":"MAX(M122:M176)","v":62153},{"$f":"C122","v":"Lombardia"},10088484,61.607868932537336,38.392131067462664,null,{"$f":"IFERROR(SMALL(B$1261:B$1281,COUNTBLANK($G$1261:G1263)),\"\")","v":958},"Valle d'Aosta"]
[null,{"$f":"MAX(M182:M236)","v":2224},{"$f":"C182","v":"P.A. Bolzano"},533050,41.722164900103181,58.277835099896819,null,{"$f":"IFERROR(SMALL(B$1261:B$1281,COUNTBLANK($G$1261:G1264)),\"\")","v":971},"Calabria"]
[null,{"$f":"MAX(M242:M296)","v":3220},{"$f":"C242","v":"P.A. Trento"},541380,59.477631238686321,40.522368761313679,null,{"$f":"IFERROR(SMALL(B$1261:B$1281,COUNTBLANK($G$1261:G1265)),\"\")","v":1161},"Sardegna"]
[null,{"$f":"MAX(M302:M356)","v":14624},{"$f":"C302","v":"Veneto"},4905854,29.809284988913245,70.190715011086752,null,{"$f":"IFERROR(SMALL(B$1261:B$1281,COUNTBLANK($G$1261:G1266)),\"\")","v":1322},"Umbria"]
[null,{"$f":"MAX(M362:M416)","v":2544},{"$f":"C362","v":"Friuli Venezia Giulia"},1215220,20.934480999325224,79.065519000674783,null,{"$f":"IFERROR(SMALL(B$1261:B$1281,COUNTBLANK($G$1261:G1267)),\"\")","v":2224},"P.A. Bolzano"]
[null,{"$f":"MAX(M422:M476)","v":5936},{"$f":"C422","v":"Liguria"},1550640,38.280967858432646,61.719032141567354,null,{"$f":"IFERROR(SMALL(B$1261:B$1281,COUNTBLANK($G$1261:G1268)),\"\")","v":2274},"Abruzzo"]
[null,{"$f":"MAX(M482:M536)","v":21029},{"$f":"C482","v":"Emilia Romagna"},4459477,47.155753914640663,52.844246085359337,null,{"$f":"IFERROR(SMALL(B$1261:B$1281,COUNTBLANK($G$1261:G1269)),\"\")","v":2535},"Sicilia"]
[null,{"$f":"MAX(M542:M596)","v":7666},{"$f":"C542","v":"Toscana"},3729641,20.55425709873953,79.445742901260473,null,{"$f":"IFERROR(SMALL(B$1261:B$1281,COUNTBLANK($G$1261:G1270)),\"\")","v":2544},"Friuli Venezia Giulia"]
[null,{"$f":"MAX(M602:M656)","v":1322},{"$f":"C602","v":"Umbria"},879337,15.034054065733615,84.965945934266387,null,{"$f":"IFERROR(SMALL(B$1261:B$1281,COUNTBLANK($G$1261:G1271)),\"\")","v":3184},"Puglia"]
[null,{"$f":"MAX(M662:M716)","v":5503},{"$f":"C662","v":"Marche"},1522608,36.141935416075576,63.858064583924424,null,{"$f":"IFERROR(SMALL(B$1261:B$1281,COUNTBLANK($G$1261:G1272)),\"\")","v":3220},"P.A. Trento"]
[null,{"$f":"MAX(M722:M776)","v":5232},{"$f":"C722","v":"Lazio"},5867097,8.9175276972581159,91.082472302741877,null,{"$f":"IFERROR(SMALL(B$1261:B$1281,COUNTBLANK($G$1261:G1273)),\"\")","v":3807},"Campania"]
[null,{"$f":"MAX(M782:M836)","v":2274},{"$f":"C782","v":"Abruzzo"},1304970,17.425687946849354,82.574312053150649,null,{"$f":"IFERROR(SMALL(B$1261:B$1281,COUNTBLANK($G$1261:G1274)),\"\")","v":5232},"Lazio"]
[null,{"$f":"MAX(M842:M896)","v":263},{"$f":"C842","v":"Molise"},302931,8.6818450406198107,91.318154959380195,null,{"$f":"IFERROR(SMALL(B$1261:B$1281,COUNTBLANK($G$1261:G1275)),\"\")","v":5503},"Marche"]
[null,{"$f":"MAX(M902:M956)","v":3807},{"$f":"C902","v":"Campania"},5772625,6.5949199887399583,93.40508001126004,null,{"$f":"IFERROR(SMALL(B$1261:B$1281,COUNTBLANK($G$1261:G1276)),\"\")","v":5936},"Liguria"]
[null,{"$f":"MAX(M962:M1016)","v":3184},{"$f":"C962","v":"Puglia"},4012310,7.9355782579112777,92.064421742088726,null,{"$f":"IFERROR(SMALL(B$1261:B$1281,COUNTBLANK($G$1261:G1277)),\"\")","v":7666},"Toscana"]
[null,{"$f":"MAX(M1022:M1076)","v":320},{"$f":"C1022","v":"Basilicata"},559084,5.7236479670317877,94.276352032968219,null,{"$f":"IFERROR(SMALL(B$1261:B$1281,COUNTBLANK($G$1261:G1278)),\"\")","v":14624},"Veneto"]
[null,{"$f":"MAX(M1082:M1136)","v":971},{"$f":"C1082","v":"Calabria"},1935414,5.0170144475548897,94.982985552445115,null,{"$f":"IFERROR(SMALL(B$1261:B$1281,COUNTBLANK($G$1261:G1279)),\"\")","v":18229},"Piemonte"]
[null,{"$f":"MAX(M1142:M1196)","v":2535},{"$f":"C1142","v":"Sicilia"},4969147,5.1014791874742285,94.898520812525774,null,{"$f":"IFERROR(SMALL(B$1261:B$1281,COUNTBLANK($G$1261:G1280)),\"\")","v":21029},"Emilia Romagna"]
[null,{"$f":"MAX(M1202:M1256)","v":1161},{"$f":"C1202","v":"Sardegna"},1632892,7.1100844391423319,92.889915560857673,null,{"$f":"IFERROR(SMALL(B$1261:B$1281,COUNTBLANK($G$1261:G1281)),\"\")","v":62153},"Lombardia"]
[null,null,null,{"$f":"SUM(D1261:D1281)","v":60263899},null,null,"Tot.",{"$f":"SUM(H1261:H1281)","v":165155}]
[]
[null,{"$f":"COUNTA(B1295:B1048576)+3","v":55},"Numero Campioni"]
[null,2.83,"% del \"Tasso di Mortalità\" calcolato come media di tutte le nazioni con oltre 1.000 contagi, al 01/04/20"]
[]
[]
[]
[]
[]
[]
[]
[]
["Data","Codice","Nazione","Ricoverati","Terap. Intens.","Ospedalizzati","Quarantena","Positivi","+ Positivi","Nuovi","Guariti","Deceduti","Totale","Tamponi",null,null,"x 2",null,null,"+ Nuovi","+ Guariti","+ Deceduti","+ Totali","+ Tamponi","% Positivi","% Guariti","% Deceduti","P. Stimati"]
[{"$f":"A1202","v":"2020-02-24T18:00:00"},0,"Italia",{"$f":"D2+D62+D122+D182+D242+D302+D362+D422+D482+D542+D602+D662+D722+D782+D842+D902+D962+D1022+D1082+D1142+D1202","v":101},26,127,94,221,0,221,1,7,229,4324,{"$f":"M1295","v":229},null,{"$f":"M1295","v":229},null,null,null,null,null,null,null,{"$f":"IF(M1295=0,0,H1295/M1295)","v":0.96506550218340614},{"$f":"IF(M1295=0,0,K1295/M1295)","v":4.3668122270742356E-3},{"$f":"IF(M1295=0,0,L1295/M1295)","v":3.0567685589519649E-2},{"$f":"L1295*100/B$1285","v":247.34982332155477}]
[{"$f":"A1203","v":"2020-02-25T18:00:00"},0,"Italia",{"$f":"D3+D63+D123+D183+D243+D303+D363+D423+D483+D543+D603+D663+D723+D783+D843+D903+D963+D1023+D1083+D1143+D1203","v":114},35,150,162,311,90,90,1,10,322,8623,{"$f":"IF(P1296=\"x2\",M1296,O1295)","v":229},{"$f":"IF(M1296>O1295*2,\"x2\",O1295)","v":229},{"$f":"IF(P1296=\"x2\",M1296,\"\")","v":""},null,null,{"$f":"IF(J1296-J1295=0,\"\",J1296-J1295)","v":-131},{"$f":"IF(K1296-K1295=0,\"\",K1296-K1295)","v":""},{"$f":"IF(L1296-L1295=0,\"\",L1296-L1295)","v":3},{"$f":"IF(M1296-M1295=0,\"\",M1296-M1295)","v":93},{"$f":"IF(N1296-N1295=0,\"\",N1296-N1295)","v":4299},0.96583850931677018,3.105590062111801E-3,3.1055900621118012E-2,353.35689045936397]
[{"$f":"A1204","v":"2020-02-26T18:00:00"},0,"Italia",{"$f":"D4+D64+D124+D184+D244+D304+D364+D424+D484+D544+D604+D664+D724+D784+D844+D904+D964+D1024+D1084+D1144+D1204","v":128},{"$f":"E4+E64+E124+E184+E244+E304+E364+E424+E484+E544+E604+E664+E724+E784+E844+E904+E964+E1024+E1084+E1144+E1204","v":36},{"$f":"F4+F64+F124+F184+F244+F304+F364+F424+F484+F544+F604+F664+F724+F784+F844+F904+F964+F1024+F1084+F1144+F1204","v":164},{"$f":"G4+G64+G124+G184+G244+G304+G364+G424+G484+G544+G604+G664+G724+G784+G844+G904+G964+G1024+G1084+G1144+G1204","v":221},{"$f":"H4+H64+H124+H184+H244+H304+H364+H424+H484+H544+H604+H664+H724+H784+H844+H904+H964+H1024+H1084+H1144+H1204","v":385},{"$f":"I4+I64+I124+I184+I244+I304+I364+I424+I484+I544+I604+I664+I724+I784+I844+I904+I964+I1024+I1084+I1144+I1204","v":74},{"$f":"J4+J64+J124+J184+J244+J304+J364+J424+J484+J544+J604+J664+J724+J784+J844+J904+J964+J1024+J1084+J1144+J1204","v":74},{"$f":"K4+K64+K124+K184+K244+K304+K364+K424+K484+K544+K604+K664+K724+K784+K844+K904+K964+K1024+K1084+K1144+K1204","v":3},{"$f":"L4+L64+L124+L184+L244+L304+L364+L424+L484+L544+L604+L664+L724+L784+L844+L904+L964+L1024+L1084+L1144+L1204","v":12},{"$f":"M4+M64+M124+M184+M244+M304+M364+M424+M484+M544+M604+M664+M724+M784+M844+M904+M964+M1024+M1084+M1144+M1204","v":400},{"$f":"N4+N64+N124+N184+N244+N304+N364+N424+N484+N544+N604+N664+N724+N784+N844+N904+N964+N1024+N1084+N1144+N1204","v":9587},229,229,"",null,null,-16,2,2,78,964,0.96250000000000002,7.4999999999999997E-3,0.03,424.02826855123675]
[{"$f":"A1205","v":"2020-02-27T18:00:00"},0,"Italia",{"$f":"D5+D65+D125+D185+D245+D305+D365+D425+D485+D545+D605+D665+D725+D785+D845+D905+D965+D1025+D1085+D1145+D1205","v":248},{"$f":"E5+E65+E125+E185+E245+E305+E365+E425+E485+E545+E605+E665+E725+E785+E845+E905+E965+E1025+E1085+E1145+E1205","v":56},{"$f":"F5+F65+F125+F185+F245+F305+F365+F425+F485+F545+F605+F665+F725+F785+F845+F905+F965+F1025+F1085+F1145+F1205","v":304},{"$f":"G5+G65+G125+G185+G245+G305+G365+G425+G485+G545+G605+G665+G725+G785+G845+G905+G965+G1025+G1085+G1145+G1205","v":284},{"$f":"H5+H65+H125+H185+H245+H305+H365+H425+H485+H545+H605+H665+H725+H785+H845+H905+H965+H1025+H1085+H1145+H1205","v":588},{"$f":"I5+I65+I125+I185+I245+I305+I365+I425+I485+I545+I605+I665+I725+I785+I845+I905+I965+I1025+I1085+I1145+I1205","v":203},{"$f":"J5+J65+J125+J185+J245+J305+J365+J425+J485+J545+J605+J665+J725+J785+J845+J905+J965+J1025+J1085+J1145+J1205","v":203},{"$f":"K5+K65+K125+K185+K245+K305+K365+K425+K485+K545+K605+K665+K725+K785+K845+K905+K965+K1025+K1085+K1145+K1205","v":45},{"$f":"L5+L65+L125+L185+L245+L305+L365+L425+L485+L545+L605+L665+L725+L785+L845+L905+L965+L1025+L1085+L1145+L1205","v":17},{"$f":"M5+M65+M125+M185+M245+M305+M365+M425+M485+M545+M605+M665+M725+M785+M845+M905+M965+M1025+M1085+M1145+M1205","v":650},{"$f":"N5+N65+N125+N185+N245+N305+N365+N425+N485+N545+N605+N665+N725+N785+N845+N905+N965+N1025+N1085+N1145+N1205","v":12014},650,"x2",650,null,null,129,42,5,250,2427,0.9046153846153846,6.9230769230769235E-2,2.6153846153846153E-2,600.70671378091868]
[{"$f":"A1206","v":"2020-02-28T18:00:00"},0,"Italia",{"$f":"D6+D66+D126+D186+D246+D306+D366+D426+D486+D546+D606+D666+D726+D786+D846+D906+D966+D1026+D1086+D1146+D1206","v":345},{"$f":"E6+E66+E126+E186+E246+E306+E366+E426+E486+E546+E606+E666+E726+E786+E846+E906+E966+E1026+E1086+E1146+E1206","v":64},{"$f":"F6+F66+F126+F186+F246+F306+F366+F426+F486+F546+F606+F666+F726+F786+F846+F906+F966+F1026+F1086+F1146+F1206","v":409},{"$f":"G6+G66+G126+G186+G246+G306+G366+G426+G486+G546+G606+G666+G726+G786+G846+G906+G966+G1026+G1086+G1146+G1206","v":412},{"$f":"H6+H66+H126+H186+H246+H306+H366+H426+H486+H546+H606+H666+H726+H786+H846+H906+H966+H1026+H1086+H1146+H1206","v":821},{"$f":"I6+I66+I126+I186+I246+I306+I366+I426+I486+I546+I606+I666+I726+I786+I846+I906+I966+I1026+I1086+I1146+I1206","v":233},{"$f":"J6+J66+J126+J186+J246+J306+J366+J426+J486+J546+J606+J666+J726+J786+J846+J906+J966+J1026+J1086+J1146+J1206","v":233},{"$f":"K6+K66+K126+K186+K246+K306+K366+K426+K486+K546+K606+K666+K726+K786+K846+K906+K966+K1026+K1086+K1146+K1206","v":46},{"$f":"L6+L66+L126+L186+L246+L306+L366+L426+L486+L546+L606+L666+L726+L786+L846+L906+L966+L1026+L1086+L1146+L1206","v":21},{"$f":"M6+M66+M126+M186+M246+M306+M366+M426+M486+M546+M606+M666+M726+M786+M846+M906+M966+M1026+M1086+M1146+M1206","v":888},{"$f":"N6+N66+N126+N186+N246+N306+N366+N426+N486+N546+N606+N666+N726+N786+N846+N906+N966+N1026+N1086+N1146+N1206","v":15695},650,650,"",null,null,30,1,4,238,3681,0.9245495495495496,5.18018018018018E-2,2.364864864864865E-2,742.04946996466424]
[{"$f":"A1207","v":"2020-02-29T17:00:00"},0,"Italia",{"$f":"D7+D67+D127+D187+D247+D307+D367+D427+D487+D547+D607+D667+D727+D787+D847+D907+D967+D1027+D1087+D1147+D1207","v":401},{"$f":"E7+E67+E127+E187+E247+E307+E367+E427+E487+E547+E607+E667+E727+E787+E847+E907+E967+E1027+E1087+E1147+E1207","v":105},{"$f":"F7+F67+F127+F187+F247+F307+F367+F427+F487+F547+F607+F667+F727+F787+F847+F907+F967+F1027+F1087+F1147+F1207","v":506},{"$f":"G7+G67+G127+G187+G247+G307+G367+G427+G487+G547+G607+G667+G727+G787+G847+G907+G967+G1027+G1087+G1147+G1207","v":543},{"$f":"H7+H67+H127+H187+H247+H307+H367+H427+H487+H547+H607+H667+H727+H787+H847+H907+H967+H1027+H1087+H1147+H1207","v":1049},{"$f":"I7+I67+I127+I187+I247+I307+I367+I427+I487+I547+I607+I667+I727+I787+I847+I907+I967+I1027+I1087+I1147+I1207","v":228},{"$f":"J7+J67+J127+J187+J247+J307+J367+J427+J487+J547+J607+J667+J727+J787+J847+J907+J967+J1027+J1087+J1147+J1207","v":228},{"$f":"K7+K67+K127+K187+K247+K307+K367+K427+K487+K547+K607+K667+K727+K787+K847+K907+K967+K1027+K1087+K1147+K1207","v":50},{"$f":"L7+L67+L127+L187+L247+L307+L367+L427+L487+L547+L607+L667+L727+L787+L847+L907+L967+L1027+L1087+L1147+L1207","v":29},{"$f":"M7+M67+M127+M187+M247+M307+M367+M427+M487+M547+M607+M667+M727+M787+M847+M907+M967+M1027+M1087+M1147+M1207","v":1128},{"$f":"N7+N67+N127+N187+N247+N307+N367+N427+N487+N547+N607+N667+N727+N787+N847+N907+N967+N1027+N1087+N1147+N1207","v":18661},650,650,"",null,null,-5,4,8,240,2966,0.92996453900709219,4.4326241134751775E-2,2.5709219858156027E-2,1024.7349823321554]
[{"$f":"A1208","v":"2020-03-01T17:00:00"},0,"Italia",{"$f":"D8+D68+D128+D188+D248+D308+D368+D428+D488+D548+D608+D668+D728+D788+D848+D908+D968+D1028+D1088+D1148+D1208","v":639},{"$f":"E8+E68+E128+E188+E248+E308+E368+E428+E488+E548+E608+E668+E728+E788+E848+E908+E968+E1028+E1088+E1148+E1208","v":140},{"$f":"F8+F68+F128+F188+F248+F308+F368+F428+F488+F548+F608+F668+F728+F788+F848+F908+F968+F1028+F1088+F1148+F1208","v":779},{"$f":"G8+G68+G128+G188+G248+G308+G368+G428+G488+G548+G608+G668+G728+G788+G848+G908+G968+G1028+G1088+G1148+G1208","v":798},{"$f":"H8+H68+H128+H188+H248+H308+H368+H428+H488+H548+H608+H668+H728+H788+H848+H908+H968+H1028+H1088+H1148+H1208","v":1577},{"$f":"I8+I68+I128+I188+I248+I308+I368+I428+I488+I548+I608+I668+I728+I788+I848+I908+I968+I1028+I1088+I1148+I1208","v":528},{"$f":"J8+J68+J128+J188+J248+J308+J368+J428+J488+J548+J608+J668+J728+J788+J848+J908+J968+J1028+J1088+J1148+J1208","v":528},{"$f":"K8+K68+K128+K188+K248+K308+K368+K428+K488+K548+K608+K668+K728+K788+K848+K908+K968+K1028+K1088+K1148+K1208","v":83},{"$f":"L8+L68+L128+L188+L248+L308+L368+L428+L488+L548+L608+L668+L728+L788+L848+L908+L968+L1028+L1088+L1148+L1208","v":34},{"$f":"M8+M68+M128+M188+M248+M308+M368+M428+M488+M548+M608+M668+M728+M788+M848+M908+M968+M1028+M1088+M1148+M1208","v":1694},{"$f":"N8+N68+N128+N188+N248+N308+N368+N428+N488+N548+N608+N668+N728+N788+N848+N908+N968+N1028+N1088+N1148+N1208","v":21127},1694,"x2",1694,null,null,300,33,5,566,2466,0.93093270365997638,4.8996458087367176E-2,2.0070838252656435E-2,1201.4134275618374]
[{"$f":"A1209","v":"2020-03-02T18:00:00"},0,"Italia",{"$f":"D9+D69+D129+D189+D249+D309+D369+D429+D489+D549+D609+D669+D729+D789+D849+D909+D969+D1029+D1089+D1149+D1209","v":742},{"$f":"E9+E69+E129+E189+E249+E309+E369+E429+E489+E549+E609+E669+E729+E789+E849+E909+E969+E1029+E1089+E1149+E1209","v":166},{"$f":"F9+F69+F129+F189+F249+F309+F369+F429+F489+F549+F609+F669+F729+F789+F849+F909+F969+F1029+F1089+F1149+F1209","v":908},{"$f":"G9+G69+G129+G189+G249+G309+G369+G429+G489+G549+G609+G669+G729+G789+G849+G909+G969+G1029+G1089+G1149+G1209","v":927},{"$f":"H9+H69+H129+H189+H249+H309+H369+H429+H489+H549+H609+H669+H729+H789+H849+H909+H969+H1029+H1089+H1149+H1209","v":1835},{"$f":"I9+I69+I129+I189+I249+I309+I369+I429+I489+I549+I609+I669+I729+I789+I849+I909+I969+I1029+I1089+I1149+I1209","v":258},{"$f":"J9+J69+J129+J189+J249+J309+J369+J429+J489+J549+J609+J669+J729+J789+J849+J909+J969+J1029+J1089+J1149+J1209","v":258},{"$f":"K9+K69+K129+K189+K249+K309+K369+K429+K489+K549+K609+K669+K729+K789+K849+K909+K969+K1029+K1089+K1149+K1209","v":149},{"$f":"L9+L69+L129+L189+L249+L309+L369+L429+L489+L549+L609+L669+L729+L789+L849+L909+L969+L1029+L1089+L1149+L1209","v":52},{"$f":"M9+M69+M129+M189+M249+M309+M369+M429+M489+M549+M609+M669+M729+M789+M849+M909+M969+M1029+M1089+M1149+M1209","v":2036},{"$f":"N9+N69+N129+N189+N249+N309+N369+N429+N489+N549+N609+N669+N729+N789+N849+N909+N969+N1029+N1089+N1149+N1209","v":23345},1694,1694,"",null,null,-270,66,18,342,2218,0.90127701375245584,7.3182711198428285E-2,2.5540275049115914E-2,1837.4558303886924]
[{"$f":"A1210","v":"2020-03-03T18:00:00"},0,"Italia",{"$f":"D10+D70+D130+D190+D250+D310+D370+D430+D490+D550+D610+D670+D730+D790+D850+D910+D970+D1030+D1090+D1150+D1210","v":1034},{"$f":"E10+E70+E130+E190+E250+E310+E370+E430+E490+E550+E610+E670+E730+E790+E850+E910+E970+E1030+E1090+E1150+E1210","v":229},{"$f":"F10+F70+F130+F190+F250+F310+F370+F430+F490+F550+F610+F670+F730+F790+F850+F910+F970+F1030+F1090+F1150+F1210","v":1263},{"$f":"G10+G70+G130+G190+G250+G310+G370+G430+G490+G550+G610+G670+G730+G790+G850+G910+G970+G1030+G1090+G1150+G1210","v":1000},{"$f":"H10+H70+H130+H190+H250+H310+H370+H430+H490+H550+H610+H670+H730+H790+H850+H910+H970+H1030+H1090+H1150+H1210","v":2263},{"$f":"I10+I70+I130+I190+I250+I310+I370+I430+I490+I550+I610+I670+I730+I790+I850+I910+I970+I1030+I1090+I1150+I1210","v":428},{"$f":"J10+J70+J130+J190+J250+J310+J370+J430+J490+J550+J610+J670+J730+J790+J850+J910+J970+J1030+J1090+J1150+J1210","v":428},{"$f":"K10+K70+K130+K190+K250+K310+K370+K430+K490+K550+K610+K670+K730+K790+K850+K910+K970+K1030+K1090+K1150+K1210","v":160},{"$f":"L10+L70+L130+L190+L250+L310+L370+L430+L490+L550+L610+L670+L730+L790+L850+L910+L970+L1030+L1090+L1150+L1210","v":79},{"$f":"M10+M70+M130+M190+M250+M310+M370+M430+M490+M550+M610+M670+M730+M790+M850+M910+M970+M1030+M1090+M1150+M1210","v":2502},{"$f":"N10+N70+N130+N190+N250+N310+N370+N430+N490+N550+N610+N670+N730+N790+N850+N910+N970+N1030+N1090+N1150+N1210","v":25856},1694,1694,"",null,null,170,11,27,466,2511,0.90447641886490804,6.3948840927258194E-2,3.1574740207833733E-2,2791.519434628975]
[{"$f":"A1211","v":"2020-03-04T17:00:00"},0,"Italia",{"$f":"D11+D71+D131+D191+D251+D311+D371+D431+D491+D551+D611+D671+D731+D791+D851+D911+D971+D1031+D1091+D1151+D1211","v":1346},{"$f":"E11+E71+E131+E191+E251+E311+E371+E431+E491+E551+E611+E671+E731+E791+E851+E911+E971+E1031+E1091+E1151+E1211","v":295},{"$f":"F11+F71+F131+F191+F251+F311+F371+F431+F491+F551+F611+F671+F731+F791+F851+F911+F971+F1031+F1091+F1151+F1211","v":1641},{"$f":"G11+G71+G131+G191+G251+G311+G371+G431+G491+G551+G611+G671+G731+G791+G851+G911+G971+G1031+G1091+G1151+G1211","v":1065},{"$f":"H11+H71+H131+H191+H251+H311+H371+H431+H491+H551+H611+H671+H731+H791+H851+H911+H971+H1031+H1091+H1151+H1211","v":2706},{"$f":"I11+I71+I131+I191+I251+I311+I371+I431+I491+I551+I611+I671+I731+I791+I851+I911+I971+I1031+I1091+I1151+I1211","v":443},{"$f":"J11+J71+J131+J191+J251+J311+J371+J431+J491+J551+J611+J671+J731+J791+J851+J911+J971+J1031+J1091+J1151+J1211","v":443},{"$f":"K11+K71+K131+K191+K251+K311+K371+K431+K491+K551+K611+K671+K731+K791+K851+K911+K971+K1031+K1091+K1151+K1211","v":276},{"$f":"L11+L71+L131+L191+L251+L311+L371+L431+L491+L551+L611+L671+L731+L791+L851+L911+L971+L1031+L1091+L1151+L1211","v":107},{"$f":"M11+M71+M131+M191+M251+M311+M371+M431+M491+M551+M611+M671+M731+M791+M851+M911+M971+M1031+M1091+M1151+M1211","v":3089},{"$f":"N11+N71+N131+N191+N251+N311+N371+N431+N491+N551+N611+N671+N731+N791+N851+N911+N971+N1031+N1091+N1151+N1211","v":29837},1694,1694,"",null,null,15,116,28,587,3981,0.87601165425704108,8.9349303981871159E-2,3.463904176108773E-2,3780.9187279151943]
[{"$f":"A1212","v":"2020-03-05T17:00:00"},0,"Italia",{"$f":"D12+D72+D132+D192+D252+D312+D372+D432+D492+D552+D612+D672+D732+D792+D852+D912+D972+D1032+D1092+D1152+D1212","v":1790},{"$f":"E12+E72+E132+E192+E252+E312+E372+E432+E492+E552+E612+E672+E732+E792+E852+E912+E972+E1032+E1092+E1152+E1212","v":351},{"$f":"F12+F72+F132+F192+F252+F312+F372+F432+F492+F552+F612+F672+F732+F792+F852+F912+F972+F1032+F1092+F1152+F1212","v":2141},{"$f":"G12+G72+G132+G192+G252+G312+G372+G432+G492+G552+G612+G672+G732+G792+G852+G912+G972+G1032+G1092+G1152+G1212","v":1155},{"$f":"H12+H72+H132+H192+H252+H312+H372+H432+H492+H552+H612+H672+H732+H792+H852+H912+H972+H1032+H1092+H1152+H1212","v":3296},{"$f":"I12+I72+I132+I192+I252+I312+I372+I432+I492+I552+I612+I672+I732+I792+I852+I912+I972+I1032+I1092+I1152+I1212","v":590},{"$f":"J12+J72+J132+J192+J252+J312+J372+J432+J492+J552+J612+J672+J732+J792+J852+J912+J972+J1032+J1092+J1152+J1212","v":590},{"$f":"K12+K72+K132+K192+K252+K312+K372+K432+K492+K552+K612+K672+K732+K792+K852+K912+K972+K1032+K1092+K1152+K1212","v":414},{"$f":"L12+L72+L132+L192+L252+L312+L372+L432+L492+L552+L612+L672+L732+L792+L852+L912+L972+L1032+L1092+L1152+L1212","v":148},{"$f":"M12+M72+M132+M192+M252+M312+M372+M432+M492+M552+M612+M672+M732+M792+M852+M912+M972+M1032+M1092+M1152+M1212","v":3858},{"$f":"N12+N72+N132+N192+N252+N312+N372+N432+N492+N552+N612+N672+N732+N792+N852+N912+N972+N1032+N1092+N1152+N1212","v":32362},3858,"x2",3858,null,null,147,138,41,769,2525,0.85432866770347327,0.10730948678071539,3.8361845515811302E-2,5229.681978798586]
[{"$f":"A1213","v":"2020-03-06T17:00:00"},0,"Italia",{"$f":"D13+D73+D133+D193+D253+D313+D373+D433+D493+D553+D613+D673+D733+D793+D853+D913+D973+D1033+D1093+D1153+D1213","v":2394},{"$f":"E13+E73+E133+E193+E253+E313+E373+E433+E493+E553+E613+E673+E733+E793+E853+E913+E973+E1033+E1093+E1153+E1213","v":462},{"$f":"F13+F73+F133+F193+F253+F313+F373+F433+F493+F553+F613+F673+F733+F793+F853+F913+F973+F1033+F1093+F1153+F1213","v":2856},{"$f":"G13+G73+G133+G193+G253+G313+G373+G433+G493+G553+G613+G673+G733+G793+G853+G913+G973+G1033+G1093+G1153+G1213","v":1060},{"$f":"H13+H73+H133+H193+H253+H313+H373+H433+H493+H553+H613+H673+H733+H793+H853+H913+H973+H1033+H1093+H1153+H1213","v":3916},{"$f":"I13+I73+I133+I193+I253+I313+I373+I433+I493+I553+I613+I673+I733+I793+I853+I913+I973+I1033+I1093+I1153+I1213","v":620},{"$f":"J13+J73+J133+J193+J253+J313+J373+J433+J493+J553+J613+J673+J733+J793+J853+J913+J973+J1033+J1093+J1153+J1213","v":620},{"$f":"K13+K73+K133+K193+K253+K313+K373+K433+K493+K553+K613+K673+K733+K793+K853+K913+K973+K1033+K1093+K1153+K1213","v":523},{"$f":"L13+L73+L133+L193+L253+L313+L373+L433+L493+L553+L613+L673+L733+L793+L853+L913+L973+L1033+L1093+L1153+L1213","v":197},{"$f":"M13+M73+M133+M193+M253+M313+M373+M433+M493+M553+M613+M673+M733+M793+M853+M913+M973+M1033+M1093+M1153+M1213","v":4636},{"$f":"N13+N73+N133+N193+N253+N313+N373+N433+N493+N553+N613+N673+N733+N793+N853+N913+N973+N1033+N1093+N1153+N1213","v":36359},3858,3858,"",null,null,30,109,49,778,3997,0.84469370146678169,0.11281276962899051,4.2493528904227786E-2,6961.1307420494695]
[{"$f":"A1214","v":"2020-03-07T18:00:00"},0,"Italia",{"$f":"D14+D74+D134+D194+D254+D314+D374+D434+D494+D554+D614+D674+D734+D794+D854+D914+D974+D1034+D1094+D1154+D1214","v":2651},{"$f":"E14+E74+E134+E194+E254+E314+E374+E434+E494+E554+E614+E674+E734+E794+E854+E914+E974+E1034+E1094+E1154+E1214","v":567},{"$f":"F14+F74+F134+F194+F254+F314+F374+F434+F494+F554+F614+F674+F734+F794+F854+F914+F974+F1034+F1094+F1154+F1214","v":3218},{"$f":"G14+G74+G134+G194+G254+G314+G374+G434+G494+G554+G614+G674+G734+G794+G854+G914+G974+G1034+G1094+G1154+G1214","v":1843},{"$f":"H14+H74+H134+H194+H254+H314+H374+H434+H494+H554+H614+H674+H734+H794+H854+H914+H974+H1034+H1094+H1154+H1214","v":5061},{"$f":"I14+I74+I134+I194+I254+I314+I374+I434+I494+I554+I614+I674+I734+I794+I854+I914+I974+I1034+I1094+I1154+I1214","v":1145},{"$f":"J14+J74+J134+J194+J254+J314+J374+J434+J494+J554+J614+J674+J734+J794+J854+J914+J974+J1034+J1094+J1154+J1214","v":1145},{"$f":"K14+K74+K134+K194+K254+K314+K374+K434+K494+K554+K614+K674+K734+K794+K854+K914+K974+K1034+K1094+K1154+K1214","v":589},{"$f":"L14+L74+L134+L194+L254+L314+L374+L434+L494+L554+L614+L674+L734+L794+L854+L914+L974+L1034+L1094+L1154+L1214","v":233},{"$f":"M14+M74+M134+M194+M254+M314+M374+M434+M494+M554+M614+M674+M734+M794+M854+M914+M974+M1034+M1094+M1154+M1214","v":5883},{"$f":"N14+N74+N134+N194+N254+N314+N374+N434+N494+N554+N614+N674+N734+N794+N854+N914+N974+N1034+N1094+N1154+N1214","v":42062},3858,3858,"",null,null,525,66,36,1247,5703,0.86027536970933194,0.10011898691143974,3.9605643379228284E-2,8233.2155477031793]
[{"$f":"A1215","v":"2020-03-08T18:00:00"},0,"Italia",{"$f":"D15+D75+D135+D195+D255+D315+D375+D435+D495+D555+D615+D675+D735+D795+D855+D915+D975+D1035+D1095+D1155+D1215","v":3557},{"$f":"E15+E75+E135+E195+E255+E315+E375+E435+E495+E555+E615+E675+E735+E795+E855+E915+E975+E1035+E1095+E1155+E1215","v":650},{"$f":"F15+F75+F135+F195+F255+F315+F375+F435+F495+F555+F615+F675+F735+F795+F855+F915+F975+F1035+F1095+F1155+F1215","v":4207},{"$f":"G15+G75+G135+G195+G255+G315+G375+G435+G495+G555+G615+G675+G735+G795+G855+G915+G975+G1035+G1095+G1155+G1215","v":2180},{"$f":"H15+H75+H135+H195+H255+H315+H375+H435+H495+H555+H615+H675+H735+H795+H855+H915+H975+H1035+H1095+H1155+H1215","v":6387},{"$f":"I15+I75+I135+I195+I255+I315+I375+I435+I495+I555+I615+I675+I735+I795+I855+I915+I975+I1035+I1095+I1155+I1215","v":1326},{"$f":"J15+J75+J135+J195+J255+J315+J375+J435+J495+J555+J615+J675+J735+J795+J855+J915+J975+J1035+J1095+J1155+J1215","v":1326},{"$f":"K15+K75+K135+K195+K255+K315+K375+K435+K495+K555+K615+K675+K735+K795+K855+K915+K975+K1035+K1095+K1155+K1215","v":622},{"$f":"L15+L75+L135+L195+L255+L315+L375+L435+L495+L555+L615+L675+L735+L795+L855+L915+L975+L1035+L1095+L1155+L1215","v":366},{"$f":"M15+M75+M135+M195+M255+M315+M375+M435+M495+M555+M615+M675+M735+M795+M855+M915+M975+M1035+M1095+M1155+M1215","v":7375},{"$f":"N15+N75+N135+N195+N255+N315+N375+N435+N495+N555+N615+N675+N735+N795+N855+N915+N975+N1035+N1095+N1155+N1215","v":49937},3858,3858,"",null,null,181,33,133,1492,7875,0.8660338983050847,8.4338983050847458E-2,4.9627118644067797E-2,12932.862190812721]
[{"$f":"A1216","v":"2020-03-09T18:00:00"},0,"Italia",{"$f":"D16+D76+D136+D196+D256+D316+D376+D436+D496+D556+D616+D676+D736+D796+D856+D916+D976+D1036+D1096+D1156+D1216","v":4316},{"$f":"E16+E76+E136+E196+E256+E316+E376+E436+E496+E556+E616+E676+E736+E796+E856+E916+E976+E1036+E1096+E1156+E1216","v":733},{"$f":"F16+F76+F136+F196+F256+F316+F376+F436+F496+F556+F616+F676+F736+F796+F856+F916+F976+F1036+F1096+F1156+F1216","v":5049},{"$f":"G16+G76+G136+G196+G256+G316+G376+G436+G496+G556+G616+G676+G736+G796+G856+G916+G976+G1036+G1096+G1156+G1216","v":2936},{"$f":"H16+H76+H136+H196+H256+H316+H376+H436+H496+H556+H616+H676+H736+H796+H856+H916+H976+H1036+H1096+H1156+H1216","v":7985},{"$f":"I16+I76+I136+I196+I256+I316+I376+I436+I496+I556+I616+I676+I736+I796+I856+I916+I976+I1036+I1096+I1156+I1216","v":1598},{"$f":"J16+J76+J136+J196+J256+J316+J376+J436+J496+J556+J616+J676+J736+J796+J856+J916+J976+J1036+J1096+J1156+J1216","v":1598},{"$f":"K16+K76+K136+K196+K256+K316+K376+K436+K496+K556+K616+K676+K736+K796+K856+K916+K976+K1036+K1096+K1156+K1216","v":724},{"$f":"L16+L76+L136+L196+L256+L316+L376+L436+L496+L556+L616+L676+L736+L796+L856+L916+L976+L1036+L1096+L1156+L1216","v":463},{"$f":"M16+M76+M136+M196+M256+M316+M376+M436+M496+M556+M616+M676+M736+M796+M856+M916+M976+M1036+M1096+M1156+M1216","v":9172},{"$f":"N16+N76+N136+N196+N256+N316+N376+N436+N496+N556+N616+N676+N736+N796+N856+N916+N976+N1036+N1096+N1156+N1216","v":53826},9172,"x2",9172,null,null,272,102,97,1797,3889,0.87058438726559095,7.8935891844744879E-2,5.0479720889664195E-2,16360.424028268551]
[{"$f":"A1217","v":"2020-03-10T18:00:00"},0,"Italia",{"$f":"D17+D77+D137+D197+D257+D317+D377+D437+D497+D557+D617+D677+D737+D797+D857+D917+D977+D1037+D1097+D1157+D1217","v":5038},{"$f":"E17+E77+E137+E197+E257+E317+E377+E437+E497+E557+E617+E677+E737+E797+E857+E917+E977+E1037+E1097+E1157+E1217","v":877},{"$f":"F17+F77+F137+F197+F257+F317+F377+F437+F497+F557+F617+F677+F737+F797+F857+F917+F977+F1037+F1097+F1157+F1217","v":5915},{"$f":"G17+G77+G137+G197+G257+G317+G377+G437+G497+G557+G617+G677+G737+G797+G857+G917+G977+G1037+G1097+G1157+G1217","v":2599},{"$f":"H17+H77+H137+H197+H257+H317+H377+H437+H497+H557+H617+H677+H737+H797+H857+H917+H977+H1037+H1097+H1157+H1217","v":8514},{"$f":"I17+I77+I137+I197+I257+I317+I377+I437+I497+I557+I617+I677+I737+I797+I857+I917+I977+I1037+I1097+I1157+I1217","v":529},{"$f":"J17+J77+J137+J197+J257+J317+J377+J437+J497+J557+J617+J677+J737+J797+J857+J917+J977+J1037+J1097+J1157+J1217","v":529},{"$f":"K17+K77+K137+K197+K257+K317+K377+K437+K497+K557+K617+K677+K737+K797+K857+K917+K977+K1037+K1097+K1157+K1217","v":1004},{"$f":"L17+L77+L137+L197+L257+L317+L377+L437+L497+L557+L617+L677+L737+L797+L857+L917+L977+L1037+L1097+L1157+L1217","v":631},{"$f":"M17+M77+M137+M197+M257+M317+M377+M437+M497+M557+M617+M677+M737+M797+M857+M917+M977+M1037+M1097+M1157+M1217","v":10149},{"$f":"N17+N77+N137+N197+N257+N317+N377+N437+N497+N557+N617+N677+N737+N797+N857+N917+N977+N1037+N1097+N1157+N1217","v":60761},9172,9172,"",null,null,-1069,280,168,977,6935,0.83890038427431279,9.8926002561828749E-2,6.2173613163858506E-2,22296.819787985864]
[{"$f":"A1218","v":"2020-03-11T17:00:00"},0,"Italia",{"$f":"D18+D78+D138+D198+D258+D318+D378+D438+D498+D558+D618+D678+D738+D798+D858+D918+D978+D1038+D1098+D1158+D1218","v":5838},{"$f":"E18+E78+E138+E198+E258+E318+E378+E438+E498+E558+E618+E678+E738+E798+E858+E918+E978+E1038+E1098+E1158+E1218","v":1028},{"$f":"F18+F78+F138+F198+F258+F318+F378+F438+F498+F558+F618+F678+F738+F798+F858+F918+F978+F1038+F1098+F1158+F1218","v":6866},{"$f":"G18+G78+G138+G198+G258+G318+G378+G438+G498+G558+G618+G678+G738+G798+G858+G918+G978+G1038+G1098+G1158+G1218","v":3724},{"$f":"H18+H78+H138+H198+H258+H318+H378+H438+H498+H558+H618+H678+H738+H798+H858+H918+H978+H1038+H1098+H1158+H1218","v":10590},{"$f":"I18+I78+I138+I198+I258+I318+I378+I438+I498+I558+I618+I678+I738+I798+I858+I918+I978+I1038+I1098+I1158+I1218","v":2076},{"$f":"J18+J78+J138+J198+J258+J318+J378+J438+J498+J558+J618+J678+J738+J798+J858+J918+J978+J1038+J1098+J1158+J1218","v":2076},{"$f":"K18+K78+K138+K198+K258+K318+K378+K438+K498+K558+K618+K678+K738+K798+K858+K918+K978+K1038+K1098+K1158+K1218","v":1045},{"$f":"L18+L78+L138+L198+L258+L318+L378+L438+L498+L558+L618+L678+L738+L798+L858+L918+L978+L1038+L1098+L1158+L1218","v":827},{"$f":"M18+M78+M138+M198+M258+M318+M378+M438+M498+M558+M618+M678+M738+M798+M858+M918+M978+M1038+M1098+M1158+M1218","v":12462},{"$f":"N18+N78+N138+N198+N258+N318+N378+N438+N498+N558+N618+N678+N738+N798+N858+N918+N978+N1038+N1098+N1158+N1218","v":73154},9172,9172,"",null,null,1547,41,196,2313,12393,0.84978334135772748,8.3854918953619004E-2,6.6361739688653512E-2,29222.614840989398]
[{"$f":"A1219","v":"2020-03-12T17:00:00"},0,"Italia",{"$f":"D19+D79+D139+D199+D259+D319+D379+D439+D499+D559+D619+D679+D739+D799+D859+D919+D979+D1039+D1099+D1159+D1219","v":6650},{"$f":"E19+E79+E139+E199+E259+E319+E379+E439+E499+E559+E619+E679+E739+E799+E859+E919+E979+E1039+E1099+E1159+E1219","v":1153},{"$f":"F19+F79+F139+F199+F259+F319+F379+F439+F499+F559+F619+F679+F739+F799+F859+F919+F979+F1039+F1099+F1159+F1219","v":7803},{"$f":"G19+G79+G139+G199+G259+G319+G379+G439+G499+G559+G619+G679+G739+G799+G859+G919+G979+G1039+G1099+G1159+G1219","v":5036},{"$f":"H19+H79+H139+H199+H259+H319+H379+H439+H499+H559+H619+H679+H739+H799+H859+H919+H979+H1039+H1099+H1159+H1219","v":12839},{"$f":"I19+I79+I139+I199+I259+I319+I379+I439+I499+I559+I619+I679+I739+I799+I859+I919+I979+I1039+I1099+I1159+I1219","v":2249},{"$f":"J19+J79+J139+J199+J259+J319+J379+J439+J499+J559+J619+J679+J739+J799+J859+J919+J979+J1039+J1099+J1159+J1219","v":2249},{"$f":"K19+K79+K139+K199+K259+K319+K379+K439+K499+K559+K619+K679+K739+K799+K859+K919+K979+K1039+K1099+K1159+K1219","v":1258},{"$f":"L19+L79+L139+L199+L259+L319+L379+L439+L499+L559+L619+L679+L739+L799+L859+L919+L979+L1039+L1099+L1159+L1219","v":1016},{"$f":"M19+M79+M139+M199+M259+M319+M379+M439+M499+M559+M619+M679+M739+M799+M859+M919+M979+M1039+M1099+M1159+M1219","v":15113},{"$f":"N19+N79+N139+N199+N259+N319+N379+N439+N499+N559+N619+N679+N739+N799+N859+N919+N979+N1039+N1099+N1159+N1219","v":86011},9172,9172,"",null,null,173,213,189,2651,12857,0.84953351419307876,8.3239595050618675E-2,6.7226890756302518E-2,35901.060070671374]
[{"$f":"A1220","v":"2020-03-13T17:00:00"},0,"Italia",{"$f":"D20+D80+D140+D200+D260+D320+D380+D440+D500+D560+D620+D680+D740+D800+D860+D920+D980+D1040+D1100+D1160+D1220","v":7426},{"$f":"E20+E80+E140+E200+E260+E320+E380+E440+E500+E560+E620+E680+E740+E800+E860+E920+E980+E1040+E1100+E1160+E1220","v":1328},{"$f":"F20+F80+F140+F200+F260+F320+F380+F440+F500+F560+F620+F680+F740+F800+F860+F920+F980+F1040+F1100+F1160+F1220","v":8754},{"$f":"G20+G80+G140+G200+G260+G320+G380+G440+G500+G560+G620+G680+G740+G800+G860+G920+G980+G1040+G1100+G1160+G1220","v":6201},{"$f":"H20+H80+H140+H200+H260+H320+H380+H440+H500+H560+H620+H680+H740+H800+H860+H920+H980+H1040+H1100+H1160+H1220","v":14955},{"$f":"I20+I80+I140+I200+I260+I320+I380+I440+I500+I560+I620+I680+I740+I800+I860+I920+I980+I1040+I1100+I1160+I1220","v":2116},{"$f":"J20+J80+J140+J200+J260+J320+J380+J440+J500+J560+J620+J680+J740+J800+J860+J920+J980+J1040+J1100+J1160+J1220","v":2116},{"$f":"K20+K80+K140+K200+K260+K320+K380+K440+K500+K560+K620+K680+K740+K800+K860+K920+K980+K1040+K1100+K1160+K1220","v":1439},{"$f":"L20+L80+L140+L200+L260+L320+L380+L440+L500+L560+L620+L680+L740+L800+L860+L920+L980+L1040+L1100+L1160+L1220","v":1266},{"$f":"M20+M80+M140+M200+M260+M320+M380+M440+M500+M560+M620+M680+M740+M800+M860+M920+M980+M1040+M1100+M1160+M1220","v":17660},{"$f":"N20+N80+N140+N200+N260+N320+N380+N440+N500+N560+N620+N680+N740+N800+N860+N920+N980+N1040+N1100+N1160+N1220","v":97488},9172,9172,"",null,null,-133,181,250,2547,11477,0.84682899207248019,8.1483578708946777E-2,7.1687429218573046E-2,44734.98233215548]
[{"$f":"A1221","v":"2020-03-14T17:00:00"},0,"Italia",{"$f":"D21+D81+D141+D201+D261+D321+D381+D441+D501+D561+D621+D681+D741+D801+D861+D921+D981+D1041+D1101+D1161+D1221","v":8372},{"$f":"E21+E81+E141+E201+E261+E321+E381+E441+E501+E561+E621+E681+E741+E801+E861+E921+E981+E1041+E1101+E1161+E1221","v":1518},{"$f":"F21+F81+F141+F201+F261+F321+F381+F441+F501+F561+F621+F681+F741+F801+F861+F921+F981+F1041+F1101+F1161+F1221","v":9890},{"$f":"G21+G81+G141+G201+G261+G321+G381+G441+G501+G561+G621+G681+G741+G801+G861+G921+G981+G1041+G1101+G1161+G1221","v":7860},{"$f":"H21+H81+H141+H201+H261+H321+H381+H441+H501+H561+H621+H681+H741+H801+H861+H921+H981+H1041+H1101+H1161+H1221","v":17750},{"$f":"I21+I81+I141+I201+I261+I321+I381+I441+I501+I561+I621+I681+I741+I801+I861+I921+I981+I1041+I1101+I1161+I1221","v":2795},{"$f":"J21+J81+J141+J201+J261+J321+J381+J441+J501+J561+J621+J681+J741+J801+J861+J921+J981+J1041+J1101+J1161+J1221","v":2795},{"$f":"K21+K81+K141+K201+K261+K321+K381+K441+K501+K561+K621+K681+K741+K801+K861+K921+K981+K1041+K1101+K1161+K1221","v":1966},{"$f":"L21+L81+L141+L201+L261+L321+L381+L441+L501+L561+L621+L681+L741+L801+L861+L921+L981+L1041+L1101+L1161+L1221","v":1441},{"$f":"M21+M81+M141+M201+M261+M321+M381+M441+M501+M561+M621+M681+M741+M801+M861+M921+M981+M1041+M1101+M1161+M1221","v":21157},{"$f":"N21+N81+N141+N201+N261+N321+N381+N441+N501+N561+N621+N681+N741+N801+N861+N921+N981+N1041+N1101+N1161+N1221","v":109170},21157,"x2",21157,null,null,679,527,175,3497,11682,0.83896582691307842,9.2924327645696456E-2,6.8109845441225128E-2,50918.727915194344]
[{"$f":"A1222","v":"2020-03-15T17:00:00"},0,"Italia",{"$f":"D22+D82+D142+D202+D262+D322+D382+D442+D502+D562+D622+D682+D742+D802+D862+D922+D982+D1042+D1102+D1162+D1222","v":9663},{"$f":"E22+E82+E142+E202+E262+E322+E382+E442+E502+E562+E622+E682+E742+E802+E862+E922+E982+E1042+E1102+E1162+E1222","v":1672},{"$f":"F22+F82+F142+F202+F262+F322+F382+F442+F502+F562+F622+F682+F742+F802+F862+F922+F982+F1042+F1102+F1162+F1222","v":11335},{"$f":"G22+G82+G142+G202+G262+G322+G382+G442+G502+G562+G622+G682+G742+G802+G862+G922+G982+G1042+G1102+G1162+G1222","v":9268},{"$f":"H22+H82+H142+H202+H262+H322+H382+H442+H502+H562+H622+H682+H742+H802+H862+H922+H982+H1042+H1102+H1162+H1222","v":20603},{"$f":"I22+I82+I142+I202+I262+I322+I382+I442+I502+I562+I622+I682+I742+I802+I862+I922+I982+I1042+I1102+I1162+I1222","v":2853},{"$f":"J22+J82+J142+J202+J262+J322+J382+J442+J502+J562+J622+J682+J742+J802+J862+J922+J982+J1042+J1102+J1162+J1222","v":2853},{"$f":"K22+K82+K142+K202+K262+K322+K382+K442+K502+K562+K622+K682+K742+K802+K862+K922+K982+K1042+K1102+K1162+K1222","v":2335},{"$f":"L22+L82+L142+L202+L262+L322+L382+L442+L502+L562+L622+L682+L742+L802+L862+L922+L982+L1042+L1102+L1162+L1222","v":1809},{"$f":"M22+M82+M142+M202+M262+M322+M382+M442+M502+M562+M622+M682+M742+M802+M862+M922+M982+M1042+M1102+M1162+M1222","v":24747},{"$f":"N22+N82+N142+N202+N262+N322+N382+N442+N502+N562+N622+N682+N742+N802+N862+N922+N982+N1042+N1102+N1162+N1222","v":124899},21157,21157,"",null,null,58,369,368,3590,15729,0.8325453590334182,9.4354871297531021E-2,7.3099769669050796E-2,63922.261484098941]
[{"$f":"A1223","v":"2020-03-16T17:00:00"},0,"Italia",{"$f":"D23+D83+D143+D203+D263+D323+D383+D443+D503+D563+D623+D683+D743+D803+D863+D923+D983+D1043+D1103+D1163+D1223","v":11025},{"$f":"E23+E83+E143+E203+E263+E323+E383+E443+E503+E563+E623+E683+E743+E803+E863+E923+E983+E1043+E1103+E1163+E1223","v":1851},{"$f":"F23+F83+F143+F203+F263+F323+F383+F443+F503+F563+F623+F683+F743+F803+F863+F923+F983+F1043+F1103+F1163+F1223","v":12876},{"$f":"G23+G83+G143+G203+G263+G323+G383+G443+G503+G563+G623+G683+G743+G803+G863+G923+G983+G1043+G1103+G1163+G1223","v":10197},{"$f":"H23+H83+H143+H203+H263+H323+H383+H443+H503+H563+H623+H683+H743+H803+H863+H923+H983+H1043+H1103+H1163+H1223","v":23073},{"$f":"I23+I83+I143+I203+I263+I323+I383+I443+I503+I563+I623+I683+I743+I803+I863+I923+I983+I1043+I1103+I1163+I1223","v":2470},{"$f":"J23+J83+J143+J203+J263+J323+J383+J443+J503+J563+J623+J683+J743+J803+J863+J923+J983+J1043+J1103+J1163+J1223","v":2470},{"$f":"K23+K83+K143+K203+K263+K323+K383+K443+K503+K563+K623+K683+K743+K803+K863+K923+K983+K1043+K1103+K1163+K1223","v":2749},{"$f":"L23+L83+L143+L203+L263+L323+L383+L443+L503+L563+L623+L683+L743+L803+L863+L923+L983+L1043+L1103+L1163+L1223","v":2158},{"$f":"M23+M83+M143+M203+M263+M323+M383+M443+M503+M563+M623+M683+M743+M803+M863+M923+M983+M1043+M1103+M1163+M1223","v":27980},{"$f":"N23+N83+N143+N203+N263+N323+N383+N443+N503+N563+N623+N683+N743+N803+N863+N923+N983+N1043+N1103+N1163+N1223","v":137962},21157,21157,"",null,null,-383,414,349,3233,13063,0.82462473195139385,9.8248749106504649E-2,7.7126518942101499E-2,76254.416961130744]
[{"$f":"A1224","v":"2020-03-17T17:00:00"},0,"Italia",{"$f":"D24+D84+D144+D204+D264+D324+D384+D444+D504+D564+D624+D684+D744+D804+D864+D924+D984+D1044+D1104+D1164+D1224","v":12894},{"$f":"E24+E84+E144+E204+E264+E324+E384+E444+E504+E564+E624+E684+E744+E804+E864+E924+E984+E1044+E1104+E1164+E1224","v":2060},{"$f":"F24+F84+F144+F204+F264+F324+F384+F444+F504+F564+F624+F684+F744+F804+F864+F924+F984+F1044+F1104+F1164+F1224","v":14954},{"$f":"G24+G84+G144+G204+G264+G324+G384+G444+G504+G564+G624+G684+G744+G804+G864+G924+G984+G1044+G1104+G1164+G1224","v":11108},{"$f":"H24+H84+H144+H204+H264+H324+H384+H444+H504+H564+H624+H684+H744+H804+H864+H924+H984+H1044+H1104+H1164+H1224","v":26062},{"$f":"I24+I84+I144+I204+I264+I324+I384+I444+I504+I564+I624+I684+I744+I804+I864+I924+I984+I1044+I1104+I1164+I1224","v":2989},{"$f":"J24+J84+J144+J204+J264+J324+J384+J444+J504+J564+J624+J684+J744+J804+J864+J924+J984+J1044+J1104+J1164+J1224","v":2989},{"$f":"K24+K84+K144+K204+K264+K324+K384+K444+K504+K564+K624+K684+K744+K804+K864+K924+K984+K1044+K1104+K1164+K1224","v":2941},{"$f":"L24+L84+L144+L204+L264+L324+L384+L444+L504+L564+L624+L684+L744+L804+L864+L924+L984+L1044+L1104+L1164+L1224","v":2503},{"$f":"M24+M84+M144+M204+M264+M324+M384+M444+M504+M564+M624+M684+M744+M804+M864+M924+M984+M1044+M1104+M1164+M1224","v":31506},{"$f":"N24+N84+N144+N204+N264+N324+N384+N444+N504+N564+N624+N684+N744+N804+N864+N924+N984+N1044+N1104+N1164+N1224","v":148657},21157,21157,"",null,null,519,192,345,3526,10695,0.82720751602869291,9.3347298927188474E-2,7.9445185044118585E-2,88445.229681978803]
[{"$f":"A1225","v":"2020-03-18T17:00:00"},0,"Italia",{"$f":"D25+D85+D145+D205+D265+D325+D385+D445+D505+D565+D625+D685+D745+D805+D865+D925+D985+D1045+D1105+D1165+D1225","v":14363},{"$f":"E25+E85+E145+E205+E265+E325+E385+E445+E505+E565+E625+E685+E745+E805+E865+E925+E985+E1045+E1105+E1165+E1225","v":2257},{"$f":"F25+F85+F145+F205+F265+F325+F385+F445+F505+F565+F625+F685+F745+F805+F865+F925+F985+F1045+F1105+F1165+F1225","v":16620},{"$f":"G25+G85+G145+G205+G265+G325+G385+G445+G505+G565+G625+G685+G745+G805+G865+G925+G985+G1045+G1105+G1165+G1225","v":12090},{"$f":"H25+H85+H145+H205+H265+H325+H385+H445+H505+H565+H625+H685+H745+H805+H865+H925+H985+H1045+H1105+H1165+H1225","v":28710},{"$f":"I25+I85+I145+I205+I265+I325+I385+I445+I505+I565+I625+I685+I745+I805+I865+I925+I985+I1045+I1105+I1165+I1225","v":2648},{"$f":"J25+J85+J145+J205+J265+J325+J385+J445+J505+J565+J625+J685+J745+J805+J865+J925+J985+J1045+J1105+J1165+J1225","v":2648},{"$f":"K25+K85+K145+K205+K265+K325+K385+K445+K505+K565+K625+K685+K745+K805+K865+K925+K985+K1045+K1105+K1165+K1225","v":4025},{"$f":"L25+L85+L145+L205+L265+L325+L385+L445+L505+L565+L625+L685+L745+L805+L865+L925+L985+L1045+L1105+L1165+L1225","v":2978},{"$f":"M25+M85+M145+M205+M265+M325+M385+M445+M505+M565+M625+M685+M745+M805+M865+M925+M985+M1045+M1105+M1165+M1225","v":35713},{"$f":"N25+N85+N145+N205+N265+N325+N385+N445+N505+N565+N625+N685+N745+N805+N865+N925+N985+N1045+N1105+N1165+N1225","v":165541},21157,21157,"",null,null,-341,1084,475,4207,16884,0.80390894072186603,0.11270405734606447,8.3387001932069549E-2,105229.68197879859]
[{"$f":"A1226","v":"2020-03-19T17:00:00"},0,"Italia",{"$f":"D26+D86+D146+D206+D266+D326+D386+D446+D506+D566+D626+D686+D746+D806+D866+D926+D986+D1046+D1106+D1166+D1226","v":15757},{"$f":"E26+E86+E146+E206+E266+E326+E386+E446+E506+E566+E626+E686+E746+E806+E866+E926+E986+E1046+E1106+E1166+E1226","v":2498},{"$f":"F26+F86+F146+F206+F266+F326+F386+F446+F506+F566+F626+F686+F746+F806+F866+F926+F986+F1046+F1106+F1166+F1226","v":18255},{"$f":"G26+G86+G146+G206+G266+G326+G386+G446+G506+G566+G626+G686+G746+G806+G866+G926+G986+G1046+G1106+G1166+G1226","v":14935},{"$f":"H26+H86+H146+H206+H266+H326+H386+H446+H506+H566+H626+H686+H746+H806+H866+H926+H986+H1046+H1106+H1166+H1226","v":33190},{"$f":"I26+I86+I146+I206+I266+I326+I386+I446+I506+I566+I626+I686+I746+I806+I866+I926+I986+I1046+I1106+I1166+I1226","v":4480},{"$f":"J26+J86+J146+J206+J266+J326+J386+J446+J506+J566+J626+J686+J746+J806+J866+J926+J986+J1046+J1106+J1166+J1226","v":4480},{"$f":"K26+K86+K146+K206+K266+K326+K386+K446+K506+K566+K626+K686+K746+K806+K866+K926+K986+K1046+K1106+K1166+K1226","v":4440},{"$f":"L26+L86+L146+L206+L266+L326+L386+L446+L506+L566+L626+L686+L746+L806+L866+L926+L986+L1046+L1106+L1166+L1226","v":3405},{"$f":"M26+M86+M146+M206+M266+M326+M386+M446+M506+M566+M626+M686+M746+M806+M866+M926+M986+M1046+M1106+M1166+M1226","v":41035},{"$f":"N26+N86+N146+N206+N266+N326+N386+N446+N506+N566+N626+N686+N746+N806+N866+N926+N986+N1046+N1106+N1166+N1226","v":182777},21157,21157,"",null,null,1832,415,427,5322,17236,0.80882173754112341,0.10820031680272937,8.297794565614719E-2,120318.02120141343]
[{"$f":"A1227","v":"2020-03-20T17:00:00"},0,"Italia",{"$f":"D27+D87+D147+D207+D267+D327+D387+D447+D507+D567+D627+D687+D747+D807+D867+D927+D987+D1047+D1107+D1167+D1227","v":16020},{"$f":"E27+E87+E147+E207+E267+E327+E387+E447+E507+E567+E627+E687+E747+E807+E867+E927+E987+E1047+E1107+E1167+E1227","v":2655},{"$f":"F27+F87+F147+F207+F267+F327+F387+F447+F507+F567+F627+F687+F747+F807+F867+F927+F987+F1047+F1107+F1167+F1227","v":18675},{"$f":"G27+G87+G147+G207+G267+G327+G387+G447+G507+G567+G627+G687+G747+G807+G867+G927+G987+G1047+G1107+G1167+G1227","v":19185},{"$f":"H27+H87+H147+H207+H267+H327+H387+H447+H507+H567+H627+H687+H747+H807+H867+H927+H987+H1047+H1107+H1167+H1227","v":37860},{"$f":"I27+I87+I147+I207+I267+I327+I387+I447+I507+I567+I627+I687+I747+I807+I867+I927+I987+I1047+I1107+I1167+I1227","v":4670},{"$f":"J27+J87+J147+J207+J267+J327+J387+J447+J507+J567+J627+J687+J747+J807+J867+J927+J987+J1047+J1107+J1167+J1227","v":4670},{"$f":"K27+K87+K147+K207+K267+K327+K387+K447+K507+K567+K627+K687+K747+K807+K867+K927+K987+K1047+K1107+K1167+K1227","v":5129},{"$f":"L27+L87+L147+L207+L267+L327+L387+L447+L507+L567+L627+L687+L747+L807+L867+L927+L987+L1047+L1107+L1167+L1227","v":4032},{"$f":"M27+M87+M147+M207+M267+M327+M387+M447+M507+M567+M627+M687+M747+M807+M867+M927+M987+M1047+M1107+M1167+M1227","v":47021},{"$f":"N27+N87+N147+N207+N267+N327+N387+N447+N507+N567+N627+N687+N747+N807+N867+N927+N987+N1047+N1107+N1167+N1227","v":206886},47021,"x2",47021,null,null,{"$f":"IF(J1320-J1319=0,\"\",J1320-J1319)","v":190},{"$f":"IF(K1320-K1319=0,\"\",K1320-K1319)","v":689},{"$f":"IF(L1320-L1319=0,\"\",L1320-L1319)","v":627},5986,{"$f":"IF(N1320-N1319=0,\"\",N1320-N1319)","v":24109},0.8051721571212862,0.10907892218370516,8.5748920695008612E-2,142473.49823321553]
[{"$f":"A1228","v":"2020-03-21T17:00:00"},0,"Italia",{"$f":"D28+D88+D148+D208+D268+D328+D388+D448+D508+D568+D628+D688+D748+D808+D868+D928+D988+D1048+D1108+D1168+D1228","v":17708},{"$f":"E28+E88+E148+E208+E268+E328+E388+E448+E508+E568+E628+E688+E748+E808+E868+E928+E988+E1048+E1108+E1168+E1228","v":2857},{"$f":"F28+F88+F148+F208+F268+F328+F388+F448+F508+F568+F628+F688+F748+F808+F868+F928+F988+F1048+F1108+F1168+F1228","v":20565},{"$f":"G28+G88+G148+G208+G268+G328+G388+G448+G508+G568+G628+G688+G748+G808+G868+G928+G988+G1048+G1108+G1168+G1228","v":22116},{"$f":"H28+H88+H148+H208+H268+H328+H388+H448+H508+H568+H628+H688+H748+H808+H868+H928+H988+H1048+H1108+H1168+H1228","v":42681},{"$f":"I28+I88+I148+I208+I268+I328+I388+I448+I508+I568+I628+I688+I748+I808+I868+I928+I988+I1048+I1108+I1168+I1228","v":4821},{"$f":"J28+J88+J148+J208+J268+J328+J388+J448+J508+J568+J628+J688+J748+J808+J868+J928+J988+J1048+J1108+J1168+J1228","v":4821},{"$f":"K28+K88+K148+K208+K268+K328+K388+K448+K508+K568+K628+K688+K748+K808+K868+K928+K988+K1048+K1108+K1168+K1228","v":6072},{"$f":"L28+L88+L148+L208+L268+L328+L388+L448+L508+L568+L628+L688+L748+L808+L868+L928+L988+L1048+L1108+L1168+L1228","v":4825},{"$f":"M28+M88+M148+M208+M268+M328+M388+M448+M508+M568+M628+M688+M748+M808+M868+M928+M988+M1048+M1108+M1168+M1228","v":53578},{"$f":"N28+N88+N148+N208+N268+N328+N388+N448+N508+N568+N628+N688+N748+N808+N868+N928+N988+N1048+N1108+N1168+N1228","v":233222},47021,47021,"",null,null,151,943,793,{"$f":"IF(M1321-M1320=0,\"\",M1321-M1320)","v":6557},26336,0.79661428198141027,0.11333009817462392,9.0055619843965803E-2,170494.6996466431]
[{"$f":"A1229","v":"2020-03-22T17:00:00"},0,"Italia",{"$f":"D29+D89+D149+D209+D269+D329+D389+D449+D509+D569+D629+D689+D749+D809+D869+D929+D989+D1049+D1109+D1169+D1229","v":19846},{"$f":"E29+E89+E149+E209+E269+E329+E389+E449+E509+E569+E629+E689+E749+E809+E869+E929+E989+E1049+E1109+E1169+E1229","v":3009},{"$f":"F29+F89+F149+F209+F269+F329+F389+F449+F509+F569+F629+F689+F749+F809+F869+F929+F989+F1049+F1109+F1169+F1229","v":22855},{"$f":"G29+G89+G149+G209+G269+G329+G389+G449+G509+G569+G629+G689+G749+G809+G869+G929+G989+G1049+G1109+G1169+G1229","v":23783},{"$f":"H29+H89+H149+H209+H269+H329+H389+H449+H509+H569+H629+H689+H749+H809+H869+H929+H989+H1049+H1109+H1169+H1229","v":46638},{"$f":"I29+I89+I149+I209+I269+I329+I389+I449+I509+I569+I629+I689+I749+I809+I869+I929+I989+I1049+I1109+I1169+I1229","v":3957},{"$f":"J29+J89+J149+J209+J269+J329+J389+J449+J509+J569+J629+J689+J749+J809+J869+J929+J989+J1049+J1109+J1169+J1229","v":3957},{"$f":"K29+K89+K149+K209+K269+K329+K389+K449+K509+K569+K629+K689+K749+K809+K869+K929+K989+K1049+K1109+K1169+K1229","v":7024},{"$f":"L29+L89+L149+L209+L269+L329+L389+L449+L509+L569+L629+L689+L749+L809+L869+L929+L989+L1049+L1109+L1169+L1229","v":5476},{"$f":"M29+M89+M149+M209+M269+M329+M389+M449+M509+M569+M629+M689+M749+M809+M869+M929+M989+M1049+M1109+M1169+M1229","v":59138},{"$f":"N29+N89+N149+N209+N269+N329+N389+N449+N509+N569+N629+N689+N749+N809+N869+N929+N989+N1049+N1109+N1169+N1229","v":258402},47021,47021,"",null,null,-864,952,651,5560,25180,0.78862998410497476,0.11877303933173256,9.2596976563292632E-2,193498.23321554769]
[{"$f":"A1230","v":"2020-03-23T17:00:00"},0,"Italia",{"$f":"D30+D90+D150+D210+D270+D330+D390+D450+D510+D570+D630+D690+D750+D810+D870+D930+D990+D1050+D1110+D1170+D1230","v":20692},{"$f":"E30+E90+E150+E210+E270+E330+E390+E450+E510+E570+E630+E690+E750+E810+E870+E930+E990+E1050+E1110+E1170+E1230","v":3204},{"$f":"F30+F90+F150+F210+F270+F330+F390+F450+F510+F570+F630+F690+F750+F810+F870+F930+F990+F1050+F1110+F1170+F1230","v":23896},{"$f":"G30+G90+G150+G210+G270+G330+G390+G450+G510+G570+G630+G690+G750+G810+G870+G930+G990+G1050+G1110+G1170+G1230","v":26522},{"$f":"H30+H90+H150+H210+H270+H330+H390+H450+H510+H570+H630+H690+H750+H810+H870+H930+H990+H1050+H1110+H1170+H1230","v":50418},{"$f":"I30+I90+I150+I210+I270+I330+I390+I450+I510+I570+I630+I690+I750+I810+I870+I930+I990+I1050+I1110+I1170+I1230","v":3780},{"$f":"J30+J90+J150+J210+J270+J330+J390+J450+J510+J570+J630+J690+J750+J810+J870+J930+J990+J1050+J1110+J1170+J1230","v":3780},{"$f":"K30+K90+K150+K210+K270+K330+K390+K450+K510+K570+K630+K690+K750+K810+K870+K930+K990+K1050+K1110+K1170+K1230","v":7432},{"$f":"L30+L90+L150+L210+L270+L330+L390+L450+L510+L570+L630+L690+L750+L810+L870+L930+L990+L1050+L1110+L1170+L1230","v":6077},{"$f":"M30+M90+M150+M210+M270+M330+M390+M450+M510+M570+M630+M690+M750+M810+M870+M930+M990+M1050+M1110+M1170+M1230","v":63927},{"$f":"N30+N90+N150+N210+N270+N330+N390+N450+N510+N570+N630+N690+N750+N810+N870+N930+N990+N1050+N1110+N1170+N1230","v":275468},47021,47021,"",null,null,-177,408,601,4789,17066,0.78868083908207798,0.11625760633222269,9.5061554585699315E-2,214734.98233215546]
[{"$f":"A1231","v":"2020-03-24T17:00:00"},0,"Italia",{"$f":"D31+D91+D151+D211+D271+D331+D391+D451+D511+D571+D631+D691+D751+D811+D871+D931+D991+D1051+D1111+D1171+D1231","v":21937},{"$f":"E31+E91+E151+E211+E271+E331+E391+E451+E511+E571+E631+E691+E751+E811+E871+E931+E991+E1051+E1111+E1171+E1231","v":3396},{"$f":"F31+F91+F151+F211+F271+F331+F391+F451+F511+F571+F631+F691+F751+F811+F871+F931+F991+F1051+F1111+F1171+F1231","v":25333},{"$f":"G31+G91+G151+G211+G271+G331+G391+G451+G511+G571+G631+G691+G751+G811+G871+G931+G991+G1051+G1111+G1171+G1231","v":28697},{"$f":"H31+H91+H151+H211+H271+H331+H391+H451+H511+H571+H631+H691+H751+H811+H871+H931+H991+H1051+H1111+H1171+H1231","v":54030},{"$f":"I31+I91+I151+I211+I271+I331+I391+I451+I511+I571+I631+I691+I751+I811+I871+I931+I991+I1051+I1111+I1171+I1231","v":3612},{"$f":"J31+J91+J151+J211+J271+J331+J391+J451+J511+J571+J631+J691+J751+J811+J871+J931+J991+J1051+J1111+J1171+J1231","v":3612},{"$f":"K31+K91+K151+K211+K271+K331+K391+K451+K511+K571+K631+K691+K751+K811+K871+K931+K991+K1051+K1111+K1171+K1231","v":8326},{"$f":"L31+L91+L151+L211+L271+L331+L391+L451+L511+L571+L631+L691+L751+L811+L871+L931+L991+L1051+L1111+L1171+L1231","v":6820},{"$f":"M31+M91+M151+M211+M271+M331+M391+M451+M511+M571+M631+M691+M751+M811+M871+M931+M991+M1051+M1111+M1171+M1231","v":69176},{"$f":"N31+N91+N151+N211+N271+N331+N391+N451+N511+N571+N631+N691+N751+N811+N871+N931+N991+N1051+N1111+N1171+N1231","v":296964},47021,47021,"",null,null,-168,894,743,5249,21496,0.78105123164103152,0.12035966231062796,9.8589106048340466E-2,240989.3992932862]
[{"$f":"A1232","v":"2020-03-25T17:00:00"},0,"Italia",{"$f":"D32+D92+D152+D212+D272+D332+D392+D452+D512+D572+D632+D692+D752+D812+D872+D932+D992+D1052+D1112+D1172+D1232","v":23112},{"$f":"E32+E92+E152+E212+E272+E332+E392+E452+E512+E572+E632+E692+E752+E812+E872+E932+E992+E1052+E1112+E1172+E1232","v":3489},{"$f":"F32+F92+F152+F212+F272+F332+F392+F452+F512+F572+F632+F692+F752+F812+F872+F932+F992+F1052+F1112+F1172+F1232","v":26601},{"$f":"G32+G92+G152+G212+G272+G332+G392+G452+G512+G572+G632+G692+G752+G812+G872+G932+G992+G1052+G1112+G1172+G1232","v":30920},{"$f":"H32+H92+H152+H212+H272+H332+H392+H452+H512+H572+H632+H692+H752+H812+H872+H932+H992+H1052+H1112+H1172+H1232","v":57521},{"$f":"I32+I92+I152+I212+I272+I332+I392+I452+I512+I572+I632+I692+I752+I812+I872+I932+I992+I1052+I1112+I1172+I1232","v":3491},{"$f":"J32+J92+J152+J212+J272+J332+J392+J452+J512+J572+J632+J692+J752+J812+J872+J932+J992+J1052+J1112+J1172+J1232","v":3491},{"$f":"K32+K92+K152+K212+K272+K332+K392+K452+K512+K572+K632+K692+K752+K812+K872+K932+K992+K1052+K1112+K1172+K1232","v":9362},{"$f":"L32+L92+L152+L212+L272+L332+L392+L452+L512+L572+L632+L692+L752+L812+L872+L932+L992+L1052+L1112+L1172+L1232","v":7503},{"$f":"M32+M92+M152+M212+M272+M332+M392+M452+M512+M572+M632+M692+M752+M812+M872+M932+M992+M1052+M1112+M1172+M1232","v":74386},{"$f":"N32+N92+N152+N212+N272+N332+N392+N452+N512+N572+N632+N692+N752+N812+N872+N932+N992+N1052+N1112+N1172+N1232","v":324445},47021,47021,"",null,null,-121,1036,683,5210,27481,0.77327722958621248,0.12585701610518107,0.10086575430860646,265123.67491166078]
[{"$f":"A1233","v":"2020-03-26T17:00:00"},0,"Italia",{"$f":"D33+D93+D153+D213+D273+D333+D393+D453+D513+D573+D633+D693+D753+D813+D873+D933+D993+D1053+D1113+D1173+D1233","v":24753},{"$f":"E33+E93+E153+E213+E273+E333+E393+E453+E513+E573+E633+E693+E753+E813+E873+E933+E993+E1053+E1113+E1173+E1233","v":3612},{"$f":"F33+F93+F153+F213+F273+F333+F393+F453+F513+F573+F633+F693+F753+F813+F873+F933+F993+F1053+F1113+F1173+F1233","v":28365},{"$f":"G33+G93+G153+G213+G273+G333+G393+G453+G513+G573+G633+G693+G753+G813+G873+G933+G993+G1053+G1113+G1173+G1233","v":33648},{"$f":"H33+H93+H153+H213+H273+H333+H393+H453+H513+H573+H633+H693+H753+H813+H873+H933+H993+H1053+H1113+H1173+H1233","v":62013},{"$f":"I33+I93+I153+I213+I273+I333+I393+I453+I513+I573+I633+I693+I753+I813+I873+I933+I993+I1053+I1113+I1173+I1233","v":4492},{"$f":"J33+J93+J153+J213+J273+J333+J393+J453+J513+J573+J633+J693+J753+J813+J873+J933+J993+J1053+J1113+J1173+J1233","v":4492},{"$f":"K33+K93+K153+K213+K273+K333+K393+K453+K513+K573+K633+K693+K753+K813+K873+K933+K993+K1053+K1113+K1173+K1233","v":10361},{"$f":"L33+L93+L153+L213+L273+L333+L393+L453+L513+L573+L633+L693+L753+L813+L873+L933+L993+L1053+L1113+L1173+L1233","v":8165},{"$f":"M33+M93+M153+M213+M273+M333+M393+M453+M513+M573+M633+M693+M753+M813+M873+M933+M993+M1053+M1113+M1173+M1233","v":80539},{"$f":"N33+N93+N153+N213+N273+N333+N393+N453+N513+N573+N633+N693+N753+N813+N873+N933+N993+N1053+N1113+N1173+N1233","v":361060},47021,47021,"",null,null,1001,999,662,6153,{"$f":"IF(N1326-N1325=0,\"\",N1326-N1325)","v":36615},0.76997479481990094,0.12864574926433156,0.10137945591576751,288515.90106007067]
[{"$f":"A1234","v":"2020-03-27T17:00:00"},0,"Italia",{"$f":"D34+D94+D154+D214+D274+D334+D394+D454+D514+D574+D634+D694+D754+D814+D874+D934+D994+D1054+D1114+D1174+D1234","v":26029},{"$f":"E34+E94+E154+E214+E274+E334+E394+E454+E514+E574+E634+E694+E754+E814+E874+E934+E994+E1054+E1114+E1174+E1234","v":3732},{"$f":"F34+F94+F154+F214+F274+F334+F394+F454+F514+F574+F634+F694+F754+F814+F874+F934+F994+F1054+F1114+F1174+F1234","v":29761},{"$f":"G34+G94+G154+G214+G274+G334+G394+G454+G514+G574+G634+G694+G754+G814+G874+G934+G994+G1054+G1114+G1174+G1234","v":36653},{"$f":"H34+H94+H154+H214+H274+H334+H394+H454+H514+H574+H634+H694+H754+H814+H874+H934+H994+H1054+H1114+H1174+H1234","v":66414},{"$f":"I34+I94+I154+I214+I274+I334+I394+I454+I514+I574+I634+I694+I754+I814+I874+I934+I994+I1054+I1114+I1174+I1234","v":4401},{"$f":"J34+J94+J154+J214+J274+J334+J394+J454+J514+J574+J634+J694+J754+J814+J874+J934+J994+J1054+J1114+J1174+J1234","v":5959},{"$f":"K34+K94+K154+K214+K274+K334+K394+K454+K514+K574+K634+K694+K754+K814+K874+K934+K994+K1054+K1114+K1174+K1234","v":10950},{"$f":"L34+L94+L154+L214+L274+L334+L394+L454+L514+L574+L634+L694+L754+L814+L874+L934+L994+L1054+L1114+L1174+L1234","v":9134},{"$f":"M34+M94+M154+M214+M274+M334+M394+M454+M514+M574+M634+M694+M754+M814+M874+M934+M994+M1054+M1114+M1174+M1234","v":86498},{"$f":"N34+N94+N154+N214+N274+N334+N394+N454+N514+N574+N634+N694+N754+N814+N874+N934+N994+N1054+N1114+N1174+N1234","v":394079},{"$f":"IF(P1327=\"x2\",M1327,O1326)","v":47021},{"$f":"IF(M1327>O1326*2,\"x2\",O1326)","v":47021},{"$f":"IF(P1327=\"x2\",M1327,\"\")","v":""},null,null,{"$f":"IF(J1327-J1326=0,\"\",J1327-J1326)","v":1467},589,969,5959,33019,0.76780966033896736,0.12659252237045943,0.10559781729057319,322756.18374558305]
[{"$f":"A1235","v":"2020-03-28T17:00:00"},0,"Italia",{"$f":"D35+D95+D155+D215+D275+D335+D395+D455+D515+D575+D635+D695+D755+D815+D875+D935+D995+D1055+D1115+D1175+D1235","v":26676},{"$f":"E35+E95+E155+E215+E275+E335+E395+E455+E515+E575+E635+E695+E755+E815+E875+E935+E995+E1055+E1115+E1175+E1235","v":3856},{"$f":"F35+F95+F155+F215+F275+F335+F395+F455+F515+F575+F635+F695+F755+F815+F875+F935+F995+F1055+F1115+F1175+F1235","v":30532},{"$f":"G35+G95+G155+G215+G275+G335+G395+G455+G515+G575+G635+G695+G755+G815+G875+G935+G995+G1055+G1115+G1175+G1235","v":39533},{"$f":"H35+H95+H155+H215+H275+H335+H395+H455+H515+H575+H635+H695+H755+H815+H875+H935+H995+H1055+H1115+H1175+H1235","v":70065},{"$f":"I35+I95+I155+I215+I275+I335+I395+I455+I515+I575+I635+I695+I755+I815+I875+I935+I995+I1055+I1115+I1175+I1235","v":3651},{"$f":"J35+J95+J155+J215+J275+J335+J395+J455+J515+J575+J635+J695+J755+J815+J875+J935+J995+J1055+J1115+J1175+J1235","v":5974},{"$f":"K35+K95+K155+K215+K275+K335+K395+K455+K515+K575+K635+K695+K755+K815+K875+K935+K995+K1055+K1115+K1175+K1235","v":12384},{"$f":"L35+L95+L155+L215+L275+L335+L395+L455+L515+L575+L635+L695+L755+L815+L875+L935+L995+L1055+L1115+L1175+L1235","v":10023},{"$f":"M35+M95+M155+M215+M275+M335+M395+M455+M515+M575+M635+M695+M755+M815+M875+M935+M995+M1055+M1115+M1175+M1235","v":92472},{"$f":"N35+N95+N155+N215+N275+N335+N395+N455+N515+N575+N635+N695+N755+N815+N875+N935+N995+N1055+N1115+N1175+N1235","v":429526},47021,47021,"",null,null,15,1434,889,5974,35447,0.75768881391123799,0.13392161951725928,0.10838956657150273,354169.61130742048]
[{"$f":"A1236","v":"2020-03-29T17:00:00"},0,"Italia",{"$f":"D36+D96+D156+D216+D276+D336+D396+D456+D516+D576+D636+D696+D756+D816+D876+D936+D996+D1056+D1116+D1176+D1236","v":27386},{"$f":"E36+E96+E156+E216+E276+E336+E396+E456+E516+E576+E636+E696+E756+E816+E876+E936+E996+E1056+E1116+E1176+E1236","v":3906},{"$f":"F36+F96+F156+F216+F276+F336+F396+F456+F516+F576+F636+F696+F756+F816+F876+F936+F996+F1056+F1116+F1176+F1236","v":31292},{"$f":"G36+G96+G156+G216+G276+G336+G396+G456+G516+G576+G636+G696+G756+G816+G876+G936+G996+G1056+G1116+G1176+G1236","v":42588},{"$f":"H36+H96+H156+H216+H276+H336+H396+H456+H516+H576+H636+H696+H756+H816+H876+H936+H996+H1056+H1116+H1176+H1236","v":73880},{"$f":"I36+I96+I156+I216+I276+I336+I396+I456+I516+I576+I636+I696+I756+I816+I876+I936+I996+I1056+I1116+I1176+I1236","v":3815},{"$f":"J36+J96+J156+J216+J276+J336+J396+J456+J516+J576+J636+J696+J756+J816+J876+J936+J996+J1056+J1116+J1176+J1236","v":5217},{"$f":"K36+K96+K156+K216+K276+K336+K396+K456+K516+K576+K636+K696+K756+K816+K876+K936+K996+K1056+K1116+K1176+K1236","v":13030},{"$f":"L36+L96+L156+L216+L276+L336+L396+L456+L516+L576+L636+L696+L756+L816+L876+L936+L996+L1056+L1116+L1176+L1236","v":10779},{"$f":"M36+M96+M156+M216+M276+M336+M396+M456+M516+M576+M636+M696+M756+M816+M876+M936+M996+M1056+M1116+M1176+M1236","v":97689},{"$f":"N36+N96+N156+N216+N276+N336+N396+N456+N516+N576+N636+N696+N756+N816+N876+N936+N996+N1056+N1116+N1176+N1236","v":454030},97689,"x2",97689,null,null,-757,646,756,5217,24504,0.75627757475253099,0.13338246885524471,0.1103399563922243,380883.3922261484]
[{"$f":"A1237","v":"2020-03-30T17:00:00"},0,"Italia",{"$f":"D37+D97+D157+D217+D277+D337+D397+D457+D517+D577+D637+D697+D757+D817+D877+D937+D997+D1057+D1117+D1177+D1237","v":27795},{"$f":"E37+E97+E157+E217+E277+E337+E397+E457+E517+E577+E637+E697+E757+E817+E877+E937+E997+E1057+E1117+E1177+E1237","v":3981},{"$f":"F37+F97+F157+F217+F277+F337+F397+F457+F517+F577+F637+F697+F757+F817+F877+F937+F997+F1057+F1117+F1177+F1237","v":31776},{"$f":"G37+G97+G157+G217+G277+G337+G397+G457+G517+G577+G637+G697+G757+G817+G877+G937+G997+G1057+G1117+G1177+G1237","v":43752},{"$f":"H37+H97+H157+H217+H277+H337+H397+H457+H517+H577+H637+H697+H757+H817+H877+H937+H997+H1057+H1117+H1177+H1237","v":75528},{"$f":"I37+I97+I157+I217+I277+I337+I397+I457+I517+I577+I637+I697+I757+I817+I877+I937+I997+I1057+I1117+I1177+I1237","v":1648},{"$f":"J37+J97+J157+J217+J277+J337+J397+J457+J517+J577+J637+J697+J757+J817+J877+J937+J997+J1057+J1117+J1177+J1237","v":4050},{"$f":"K37+K97+K157+K217+K277+K337+K397+K457+K517+K577+K637+K697+K757+K817+K877+K937+K997+K1057+K1117+K1177+K1237","v":14620},{"$f":"L37+L97+L157+L217+L277+L337+L397+L457+L517+L577+L637+L697+L757+L817+L877+L937+L997+L1057+L1117+L1177+L1237","v":11591},{"$f":"M37+M97+M157+M217+M277+M337+M397+M457+M517+M577+M637+M697+M757+M817+M877+M937+M997+M1057+M1117+M1177+M1237","v":101739},{"$f":"N37+N97+N157+N217+N277+N337+N397+N457+N517+N577+N637+N697+N757+N817+N877+N937+N997+N1057+N1117+N1177+N1237","v":477359},97689,97689,"",null,null,-1167,1590,812,4050,23329,0.74237018252587506,0.14370103893295591,0.11392877854116908,409575.97173144878]
[{"$f":"A1238","v":"2020-03-31T17:00:00"},0,"Italia",{"$f":"D38+D98+D158+D218+D278+D338+D398+D458+D518+D578+D638+D698+D758+D818+D878+D938+D998+D1058+D1118+D1178+D1238","v":28192},{"$f":"E38+E98+E158+E218+E278+E338+E398+E458+E518+E578+E638+E698+E758+E818+E878+E938+E998+E1058+E1118+E1178+E1238","v":4023},{"$f":"F38+F98+F158+F218+F278+F338+F398+F458+F518+F578+F638+F698+F758+F818+F878+F938+F998+F1058+F1118+F1178+F1238","v":32215},{"$f":"G38+G98+G158+G218+G278+G338+G398+G458+G518+G578+G638+G698+G758+G818+G878+G938+G998+G1058+G1118+G1178+G1238","v":45420},{"$f":"H38+H98+H158+H218+H278+H338+H398+H458+H518+H578+H638+H698+H758+H818+H878+H938+H998+H1058+H1118+H1178+H1238","v":77635},{"$f":"I38+I98+I158+I218+I278+I338+I398+I458+I518+I578+I638+I698+I758+I818+I878+I938+I998+I1058+I1118+I1178+I1238","v":2107},{"$f":"J38+J98+J158+J218+J278+J338+J398+J458+J518+J578+J638+J698+J758+J818+J878+J938+J998+J1058+J1118+J1178+J1238","v":4053},{"$f":"K38+K98+K158+K218+K278+K338+K398+K458+K518+K578+K638+K698+K758+K818+K878+K938+K998+K1058+K1118+K1178+K1238","v":15729},{"$f":"L38+L98+L158+L218+L278+L338+L398+L458+L518+L578+L638+L698+L758+L818+L878+L938+L998+L1058+L1118+L1178+L1238","v":12428},{"$f":"M38+M98+M158+M218+M278+M338+M398+M458+M518+M578+M638+M698+M758+M818+M878+M938+M998+M1058+M1118+M1178+M1238","v":105792},{"$f":"N38+N98+N158+N218+N278+N338+N398+N458+N518+N578+N638+N698+N758+N818+N878+N938+N998+N1058+N1118+N1178+N1238","v":506968},97689,97689,"",null,null,3,1109,837,4053,29609,0.73384565940713853,0.1486785390199637,0.11747580157289776,439151.9434628975]
[{"$f":"A1239","v":"2020-04-01T17:00:00"},0,"Italia",{"$f":"D39+D99+D159+D219+D279+D339+D399+D459+D519+D579+D639+D699+D759+D819+D879+D939+D999+D1059+D1119+D1179+D1239","v":28403},{"$f":"E39+E99+E159+E219+E279+E339+E399+E459+E519+E579+E639+E699+E759+E819+E879+E939+E999+E1059+E1119+E1179+E1239","v":4035},{"$f":"F39+F99+F159+F219+F279+F339+F399+F459+F519+F579+F639+F699+F759+F819+F879+F939+F999+F1059+F1119+F1179+F1239","v":32438},{"$f":"G39+G99+G159+G219+G279+G339+G399+G459+G519+G579+G639+G699+G759+G819+G879+G939+G999+G1059+G1119+G1179+G1239","v":48134},{"$f":"H39+H99+H159+H219+H279+H339+H399+H459+H519+H579+H639+H699+H759+H819+H879+H939+H999+H1059+H1119+H1179+H1239","v":80572},{"$f":"I39+I99+I159+I219+I279+I339+I399+I459+I519+I579+I639+I699+I759+I819+I879+I939+I999+I1059+I1119+I1179+I1239","v":2937},{"$f":"J39+J99+J159+J219+J279+J339+J399+J459+J519+J579+J639+J699+J759+J819+J879+J939+J999+J1059+J1119+J1179+J1239","v":4782},{"$f":"K39+K99+K159+K219+K279+K339+K399+K459+K519+K579+K639+K699+K759+K819+K879+K939+K999+K1059+K1119+K1179+K1239","v":16847},{"$f":"L39+L99+L159+L219+L279+L339+L399+L459+L519+L579+L639+L699+L759+L819+L879+L939+L999+L1059+L1119+L1179+L1239","v":13155},{"$f":"M39+M99+M159+M219+M279+M339+M399+M459+M519+M579+M639+M699+M759+M819+M879+M939+M999+M1059+M1119+M1179+M1239","v":110574},{"$f":"N39+N99+N159+N219+N279+N339+N399+N459+N519+N579+N639+N699+N759+N819+N879+N939+N999+N1059+N1119+N1179+N1239","v":541423},97689,97689,"",null,null,729,1118,727,4782,{"$f":"IF(N1332-N1331=0,\"\",N1332-N1331)","v":34455},{"$f":"IF(M1332=0,0,H1332/M1332)","v":0.72867039267820644},{"$f":"IF(M1332=0,0,K1332/M1332)","v":0.1523595058512851},{"$f":"IF(M1332=0,0,L1332/M1332)","v":0.11897010147050843},464840.98939929326]
[{"$f":"A1240","v":"2020-04-02T17:00:00"},0,"Italia",{"$f":"D40+D100+D160+D220+D280+D340+D400+D460+D520+D580+D640+D700+D760+D820+D880+D940+D1000+D1060+D1120+D1180+D1240","v":28540},{"$f":"E40+E100+E160+E220+E280+E340+E400+E460+E520+E580+E640+E700+E760+E820+E880+E940+E1000+E1060+E1120+E1180+E1240","v":4053},{"$f":"F40+F100+F160+F220+F280+F340+F400+F460+F520+F580+F640+F700+F760+F820+F880+F940+F1000+F1060+F1120+F1180+F1240","v":32593},{"$f":"G40+G100+G160+G220+G280+G340+G400+G460+G520+G580+G640+G700+G760+G820+G880+G940+G1000+G1060+G1120+G1180+G1240","v":50456},{"$f":"H40+H100+H160+H220+H280+H340+H400+H460+H520+H580+H640+H700+H760+H820+H880+H940+H1000+H1060+H1120+H1180+H1240","v":83049},{"$f":"I40+I100+I160+I220+I280+I340+I400+I460+I520+I580+I640+I700+I760+I820+I880+I940+I1000+I1060+I1120+I1180+I1240","v":2477},{"$f":"J40+J100+J160+J220+J280+J340+J400+J460+J520+J580+J640+J700+J760+J820+J880+J940+J1000+J1060+J1120+J1180+J1240","v":4668},{"$f":"K40+K100+K160+K220+K280+K340+K400+K460+K520+K580+K640+K700+K760+K820+K880+K940+K1000+K1060+K1120+K1180+K1240","v":18278},{"$f":"L40+L100+L160+L220+L280+L340+L400+L460+L520+L580+L640+L700+L760+L820+L880+L940+L1000+L1060+L1120+L1180+L1240","v":13915},{"$f":"M40+M100+M160+M220+M280+M340+M400+M460+M520+M580+M640+M700+M760+M820+M880+M940+M1000+M1060+M1120+M1180+M1240","v":115242},{"$f":"N40+N100+N160+N220+N280+N340+N400+N460+N520+N580+N640+N700+N760+N820+N880+N940+N1000+N1060+N1120+N1180+N1240","v":581232},{"$f":"IF(P1333=\"x2\",M1333,O1332)","v":97689},{"$f":"IF(M1333>O1332*2,\"x2\",O1332)","v":97689},{"$f":"IF(P1333=\"x2\",M1333,\"\")","v":""},null,null,{"$f":"IF(J1333-J1332=0,\"\",J1333-J1332)","v":-114},{"$f":"IF(K1333-K1332=0,\"\",K1333-K1332)","v":1431},{"$f":"IF(L1333-L1332=0,\"\",L1333-L1332)","v":760},{"$f":"IF(M1333-M1332=0,\"\",M1333-M1332)","v":4668},39809,0.7206487218201697,0.158605369570122,0.12074590860970827,491696.11307420494]
[{"$f":"A1241","v":"2020-04-03T17:00:00"},0,"Italia",{"$f":"D41+D101+D161+D221+D281+D341+D401+D461+D521+D581+D641+D701+D761+D821+D881+D941+D1001+D1061+D1121+D1181+D1241","v":28741},{"$f":"E41+E101+E161+E221+E281+E341+E401+E461+E521+E581+E641+E701+E761+E821+E881+E941+E1001+E1061+E1121+E1181+E1241","v":4068},{"$f":"F41+F101+F161+F221+F281+F341+F401+F461+F521+F581+F641+F701+F761+F821+F881+F941+F1001+F1061+F1121+F1181+F1241","v":32809},{"$f":"G41+G101+G161+G221+G281+G341+G401+G461+G521+G581+G641+G701+G761+G821+G881+G941+G1001+G1061+G1121+G1181+G1241","v":52579},{"$f":"H41+H101+H161+H221+H281+H341+H401+H461+H521+H581+H641+H701+H761+H821+H881+H941+H1001+H1061+H1121+H1181+H1241","v":85388},{"$f":"I41+I101+I161+I221+I281+I341+I401+I461+I521+I581+I641+I701+I761+I821+I881+I941+I1001+I1061+I1121+I1181+I1241","v":2339},{"$f":"J41+J101+J161+J221+J281+J341+J401+J461+J521+J581+J641+J701+J761+J821+J881+J941+J1001+J1061+J1121+J1181+J1241","v":4585},{"$f":"K41+K101+K161+K221+K281+K341+K401+K461+K521+K581+K641+K701+K761+K821+K881+K941+K1001+K1061+K1121+K1181+K1241","v":19758},{"$f":"L41+L101+L161+L221+L281+L341+L401+L461+L521+L581+L641+L701+L761+L821+L881+L941+L1001+L1061+L1121+L1181+L1241","v":14681},{"$f":"M41+M101+M161+M221+M281+M341+M401+M461+M521+M581+M641+M701+M761+M821+M881+M941+M1001+M1061+M1121+M1181+M1241","v":119827},{"$f":"N41+N101+N161+N221+N281+N341+N401+N461+N521+N581+N641+N701+N761+N821+N881+N941+N1001+N1061+N1121+N1181+N1241","v":619849},{"$f":"IF(P1334=\"x2\",M1334,O1333)","v":97689},{"$f":"IF(M1334>O1333*2,\"x2\",O1333)","v":97689},{"$f":"IF(P1334=\"x2\",M1334,\"\")","v":""},null,null,{"$f":"IF(J1334-J1333=0,\"\",J1334-J1333)","v":-83},{"$f":"IF(K1334-K1333=0,\"\",K1334-K1333)","v":1480},{"$f":"IF(L1334-L1333=0,\"\",L1334-L1333)","v":766},{"$f":"IF(M1334-M1333=0,\"\",M1334-M1333)","v":4585},38617,0.71259398966843868,0.16488771311974765,0.1225182972118137,{"$f":"L1334*100/B$1285","v":518763.25088339223}]
[{"$f":"A1242","v":"2020-04-04T17:00:00"},0,"Italia",{"$f":"D42+D102+D162+D222+D282+D342+D402+D462+D522+D582+D642+D702+D762+D822+D882+D942+D1002+D1062+D1122+D1182+D1242","v":29010},{"$f":"E42+E102+E162+E222+E282+E342+E402+E462+E522+E582+E642+E702+E762+E822+E882+E942+E1002+E1062+E1122+E1182+E1242","v":3994},{"$f":"F42+F102+F162+F222+F282+F342+F402+F462+F522+F582+F642+F702+F762+F822+F882+F942+F1002+F1062+F1122+F1182+F1242","v":33004},{"$f":"G42+G102+G162+G222+G282+G342+G402+G462+G522+G582+G642+G702+G762+G822+G882+G942+G1002+G1062+G1122+G1182+G1242","v":55270},{"$f":"H42+H102+H162+H222+H282+H342+H402+H462+H522+H582+H642+H702+H762+H822+H882+H942+H1002+H1062+H1122+H1182+H1242","v":88274},{"$f":"I42+I102+I162+I222+I282+I342+I402+I462+I522+I582+I642+I702+I762+I822+I882+I942+I1002+I1062+I1122+I1182+I1242","v":2886},{"$f":"J42+J102+J162+J222+J282+J342+J402+J462+J522+J582+J642+J702+J762+J822+J882+J942+J1002+J1062+J1122+J1182+J1242","v":4805},{"$f":"K42+K102+K162+K222+K282+K342+K402+K462+K522+K582+K642+K702+K762+K822+K882+K942+K1002+K1062+K1122+K1182+K1242","v":20996},{"$f":"L42+L102+L162+L222+L282+L342+L402+L462+L522+L582+L642+L702+L762+L822+L882+L942+L1002+L1062+L1122+L1182+L1242","v":15362},{"$f":"M42+M102+M162+M222+M282+M342+M402+M462+M522+M582+M642+M702+M762+M822+M882+M942+M1002+M1062+M1122+M1182+M1242","v":124632},{"$f":"N42+N102+N162+N222+N282+N342+N402+N462+N522+N582+N642+N702+N762+N822+N882+N942+N1002+N1062+N1122+N1182+N1242","v":657224},{"$f":"IF(P1335=\"x2\",M1335,O1334)","v":97689},{"$f":"IF(M1335>O1334*2,\"x2\",O1334)","v":97689},{"$f":"IF(P1335=\"x2\",M1335,\"\")","v":""},null,null,{"$f":"IF(J1335-J1334=0,\"\",J1335-J1334)","v":220},{"$f":"IF(K1335-K1334=0,\"\",K1335-K1334)","v":1238},{"$f":"IF(L1335-L1334=0,\"\",L1335-L1334)","v":681},{"$f":"IF(M1335-M1334=0,\"\",M1335-M1334)","v":4805},37375,0.70827716798254059,0.16846395789203414,0.12325887412542526,{"$f":"L1335*100/B$1285","v":542826.85512367485}]
[{"$f":"A1243","v":"2020-04-05T17:00:00"},0,"Italia",{"$f":"D43+D103+D163+D223+D283+D343+D403+D463+D523+D583+D643+D703+D763+D823+D883+D943+D1003+D1063+D1123+D1183+D1243","v":28949},{"$f":"E43+E103+E163+E223+E283+E343+E403+E463+E523+E583+E643+E703+E763+E823+E883+E943+E1003+E1063+E1123+E1183+E1243","v":3977},{"$f":"F43+F103+F163+F223+F283+F343+F403+F463+F523+F583+F643+F703+F763+F823+F883+F943+F1003+F1063+F1123+F1183+F1243","v":32926},{"$f":"G43+G103+G163+G223+G283+G343+G403+G463+G523+G583+G643+G703+G763+G823+G883+G943+G1003+G1063+G1123+G1183+G1243","v":58320},{"$f":"H43+H103+H163+H223+H283+H343+H403+H463+H523+H583+H643+H703+H763+H823+H883+H943+H1003+H1063+H1123+H1183+H1243","v":91246},{"$f":"I43+I103+I163+I223+I283+I343+I403+I463+I523+I583+I643+I703+I763+I823+I883+I943+I1003+I1063+I1123+I1183+I1243","v":2972},{"$f":"J43+J103+J163+J223+J283+J343+J403+J463+J523+J583+J643+J703+J763+J823+J883+J943+J1003+J1063+J1123+J1183+J1243","v":4316},{"$f":"K43+K103+K163+K223+K283+K343+K403+K463+K523+K583+K643+K703+K763+K823+K883+K943+K1003+K1063+K1123+K1183+K1243","v":21815},{"$f":"L43+L103+L163+L223+L283+L343+L403+L463+L523+L583+L643+L703+L763+L823+L883+L943+L1003+L1063+L1123+L1183+L1243","v":15887},{"$f":"M43+M103+M163+M223+M283+M343+M403+M463+M523+M583+M643+M703+M763+M823+M883+M943+M1003+M1063+M1123+M1183+M1243","v":128948},{"$f":"N43+N103+N163+N223+N283+N343+N403+N463+N523+N583+N643+N703+N763+N823+N883+N943+N1003+N1063+N1123+N1183+N1243","v":691461},{"$f":"IF(P1336=\"x2\",M1336,O1335)","v":97689},{"$f":"IF(M1336>O1335*2,\"x2\",O1335)","v":97689},{"$f":"IF(P1336=\"x2\",M1336,\"\")","v":""},null,null,{"$f":"IF(J1336-J1335=0,\"\",J1336-J1335)","v":-489},{"$f":"IF(K1336-K1335=0,\"\",K1336-K1335)","v":819},{"$f":"IF(L1336-L1335=0,\"\",L1336-L1335)","v":525},{"$f":"IF(M1336-M1335=0,\"\",M1336-M1335)","v":4316},34237,0.70761857492942892,0.16917672239972703,0.12320470267084406,{"$f":"L1336*100/B$1285","v":561378.09187279153}]
[{"$f":"A1244","v":"2020-04-06T17:00:00"},0,"Italia",{"$f":"D44+D104+D164+D224+D284+D344+D404+D464+D524+D584+D644+D704+D764+D824+D884+D944+D1004+D1064+D1124+D1184+D1244","v":28976},{"$f":"E44+E104+E164+E224+E284+E344+E404+E464+E524+E584+E644+E704+E764+E824+E884+E944+E1004+E1064+E1124+E1184+E1244","v":3898},{"$f":"F44+F104+F164+F224+F284+F344+F404+F464+F524+F584+F644+F704+F764+F824+F884+F944+F1004+F1064+F1124+F1184+F1244","v":32874},{"$f":"G44+G104+G164+G224+G284+G344+G404+G464+G524+G584+G644+G704+G764+G824+G884+G944+G1004+G1064+G1124+G1184+G1244","v":60313},{"$f":"H44+H104+H164+H224+H284+H344+H404+H464+H524+H584+H644+H704+H764+H824+H884+H944+H1004+H1064+H1124+H1184+H1244","v":93187},{"$f":"I44+I104+I164+I224+I284+I344+I404+I464+I524+I584+I644+I704+I764+I824+I884+I944+I1004+I1064+I1124+I1184+I1244","v":1941},{"$f":"J44+J104+J164+J224+J284+J344+J404+J464+J524+J584+J644+J704+J764+J824+J884+J944+J1004+J1064+J1124+J1184+J1244","v":3599},{"$f":"K44+K104+K164+K224+K284+K344+K404+K464+K524+K584+K644+K704+K764+K824+K884+K944+K1004+K1064+K1124+K1184+K1244","v":22837},{"$f":"L44+L104+L164+L224+L284+L344+L404+L464+L524+L584+L644+L704+L764+L824+L884+L944+L1004+L1064+L1124+L1184+L1244","v":16523},{"$f":"M44+M104+M164+M224+M284+M344+M404+M464+M524+M584+M644+M704+M764+M824+M884+M944+M1004+M1064+M1124+M1184+M1244","v":132547},{"$f":"N44+N104+N164+N224+N284+N344+N404+N464+N524+N584+N644+N704+N764+N824+N884+N944+N1004+N1064+N1124+N1184+N1244","v":721732},{"$f":"IF(P1337=\"x2\",M1337,O1336)","v":97689},{"$f":"IF(M1337>O1336*2,\"x2\",O1336)","v":97689},{"$f":"IF(P1337=\"x2\",M1337,\"\")","v":""},null,null,{"$f":"IF(J1337-J1336=0,\"\",J1337-J1336)","v":-717},{"$f":"IF(K1337-K1336=0,\"\",K1337-K1336)","v":1022},{"$f":"IF(L1337-L1336=0,\"\",L1337-L1336)","v":636},{"$f":"IF(M1337-M1336=0,\"\",M1337-M1336)","v":3599},30271,0.70304872988449385,0.17229360151493434,0.12465766860057187,{"$f":"L1337*100/B$1285","v":583851.59010600706}]
[{"$f":"A1245","v":"2020-04-07T17:00:00"},0,"Italia",{"$f":"D45+D105+D165+D225+D285+D345+D405+D465+D525+D585+D645+D705+D765+D825+D885+D945+D1005+D1065+D1125+D1185+D1245","v":28718},{"$f":"E45+E105+E165+E225+E285+E345+E405+E465+E525+E585+E645+E705+E765+E825+E885+E945+E1005+E1065+E1125+E1185+E1245","v":3792},{"$f":"F45+F105+F165+F225+F285+F345+F405+F465+F525+F585+F645+F705+F765+F825+F885+F945+F1005+F1065+F1125+F1185+F1245","v":32510},{"$f":"G45+G105+G165+G225+G285+G345+G405+G465+G525+G585+G645+G705+G765+G825+G885+G945+G1005+G1065+G1125+G1185+G1245","v":61557},{"$f":"H45+H105+H165+H225+H285+H345+H405+H465+H525+H585+H645+H705+H765+H825+H885+H945+H1005+H1065+H1125+H1185+H1245","v":94067},{"$f":"I45+I105+I165+I225+I285+I345+I405+I465+I525+I585+I645+I705+I765+I825+I885+I945+I1005+I1065+I1125+I1185+I1245","v":880},{"$f":"J45+J105+J165+J225+J285+J345+J405+J465+J525+J585+J645+J705+J765+J825+J885+J945+J1005+J1065+J1125+J1185+J1245","v":3039},{"$f":"K45+K105+K165+K225+K285+K345+K405+K465+K525+K585+K645+K705+K765+K825+K885+K945+K1005+K1065+K1125+K1185+K1245","v":24392},{"$f":"L45+L105+L165+L225+L285+L345+L405+L465+L525+L585+L645+L705+L765+L825+L885+L945+L1005+L1065+L1125+L1185+L1245","v":17127},{"$f":"M45+M105+M165+M225+M285+M345+M405+M465+M525+M585+M645+M705+M765+M825+M885+M945+M1005+M1065+M1125+M1185+M1245","v":135586},{"$f":"N45+N105+N165+N225+N285+N345+N405+N465+N525+N585+N645+N705+N765+N825+N885+N945+N1005+N1065+N1125+N1185+N1245","v":755445},{"$f":"IF(P1338=\"x2\",M1338,O1337)","v":97689},{"$f":"IF(M1338>O1337*2,\"x2\",O1337)","v":97689},{"$f":"IF(P1338=\"x2\",M1338,\"\")","v":""},null,null,{"$f":"IF(J1338-J1337=0,\"\",J1338-J1337)","v":-560},{"$f":"IF(K1338-K1337=0,\"\",K1338-K1337)","v":1555},{"$f":"IF(L1338-L1337=0,\"\",L1338-L1337)","v":604},{"$f":"IF(M1338-M1337=0,\"\",M1338-M1337)","v":3039},{"$f":"IF(N1338-N1337=0,\"\",N1338-N1337)","v":33713},{"$f":"IF(M1338=0,0,H1338/M1338)","v":0.69378106884191582},{"$f":"IF(M1338=0,0,K1338/M1338)","v":0.17990057970586934},{"$f":"IF(M1338=0,0,L1338/M1338)","v":0.12631835145221484},{"$f":"L1338*100/B$1285","v":605194.34628975263}]
[{"$f":"A1246","v":"2020-04-08T17:00:00"},0,"Italia",{"$f":"D46+D106+D166+D226+D286+D346+D406+D466+D526+D586+D646+D706+D766+D826+D886+D946+D1006+D1066+D1126+D1186+D1246","v":28485},{"$f":"E46+E106+E166+E226+E286+E346+E406+E466+E526+E586+E646+E706+E766+E826+E886+E946+E1006+E1066+E1126+E1186+E1246","v":3693},{"$f":"F46+F106+F166+F226+F286+F346+F406+F466+F526+F586+F646+F706+F766+F826+F886+F946+F1006+F1066+F1126+F1186+F1246","v":32178},{"$f":"G46+G106+G166+G226+G286+G346+G406+G466+G526+G586+G646+G706+G766+G826+G886+G946+G1006+G1066+G1126+G1186+G1246","v":63084},{"$f":"H46+H106+H166+H226+H286+H346+H406+H466+H526+H586+H646+H706+H766+H826+H886+H946+H1006+H1066+H1126+H1186+H1246","v":95262},{"$f":"I46+I106+I166+I226+I286+I346+I406+I466+I526+I586+I646+I706+I766+I826+I886+I946+I1006+I1066+I1126+I1186+I1246","v":1195},{"$f":"J46+J106+J166+J226+J286+J346+J406+J466+J526+J586+J646+J706+J766+J826+J886+J946+J1006+J1066+J1126+J1186+J1246","v":3836},{"$f":"K46+K106+K166+K226+K286+K346+K406+K466+K526+K586+K646+K706+K766+K826+K886+K946+K1006+K1066+K1126+K1186+K1246","v":26491},{"$f":"L46+L106+L166+L226+L286+L346+L406+L466+L526+L586+L646+L706+L766+L826+L886+L946+L1006+L1066+L1126+L1186+L1246","v":17669},{"$f":"M46+M106+M166+M226+M286+M346+M406+M466+M526+M586+M646+M706+M766+M826+M886+M946+M1006+M1066+M1126+M1186+M1246","v":139422},{"$f":"N46+N106+N166+N226+N286+N346+N406+N466+N526+N586+N646+N706+N766+N826+N886+N946+N1006+N1066+N1126+N1186+N1246","v":807125},{"$f":"IF(P1339=\"x2\",M1339,O1338)","v":97689},{"$f":"IF(M1339>O1338*2,\"x2\",O1338)","v":97689},{"$f":"IF(P1339=\"x2\",M1339,\"\")","v":""},null,null,{"$f":"IF(J1339-J1338=0,\"\",J1339-J1338)","v":797},{"$f":"IF(K1339-K1338=0,\"\",K1339-K1338)","v":2099},{"$f":"IF(L1339-L1338=0,\"\",L1339-L1338)","v":542},{"$f":"IF(M1339-M1338=0,\"\",M1339-M1338)","v":3836},{"$f":"IF(N1339-N1338=0,\"\",N1339-N1338)","v":51680},{"$f":"IF(M1339=0,0,H1339/M1339)","v":0.6832637603821492},{"$f":"IF(M1339=0,0,K1339/M1339)","v":0.19000588142473929},{"$f":"IF(M1339=0,0,L1339/M1339)","v":0.12673035819311157},{"$f":"L1339*100/B$1285","v":624346.28975265019}]
[{"$f":"A1247","v":"2020-04-09T17:00:00"},0,"Italia",{"$f":"D47+D107+D167+D227+D287+D347+D407+D467+D527+D587+D647+D707+D767+D827+D887+D947+D1007+D1067+D1127+D1187+D1247","v":28399},{"$f":"E47+E107+E167+E227+E287+E347+E407+E467+E527+E587+E647+E707+E767+E827+E887+E947+E1007+E1067+E1127+E1187+E1247","v":3605},{"$f":"F47+F107+F167+F227+F287+F347+F407+F467+F527+F587+F647+F707+F767+F827+F887+F947+F1007+F1067+F1127+F1187+F1247","v":32004},{"$f":"G47+G107+G167+G227+G287+G347+G407+G467+G527+G587+G647+G707+G767+G827+G887+G947+G1007+G1067+G1127+G1187+G1247","v":64873},{"$f":"H47+H107+H167+H227+H287+H347+H407+H467+H527+H587+H647+H707+H767+H827+H887+H947+H1007+H1067+H1127+H1187+H1247","v":96877},{"$f":"I47+I107+I167+I227+I287+I347+I407+I467+I527+I587+I647+I707+I767+I827+I887+I947+I1007+I1067+I1127+I1187+I1247","v":1615},{"$f":"J47+J107+J167+J227+J287+J347+J407+J467+J527+J587+J647+J707+J767+J827+J887+J947+J1007+J1067+J1127+J1187+J1247","v":4204},{"$f":"K47+K107+K167+K227+K287+K347+K407+K467+K527+K587+K647+K707+K767+K827+K887+K947+K1007+K1067+K1127+K1187+K1247","v":28470},{"$f":"L47+L107+L167+L227+L287+L347+L407+L467+L527+L587+L647+L707+L767+L827+L887+L947+L1007+L1067+L1127+L1187+L1247","v":18279},{"$f":"M47+M107+M167+M227+M287+M347+M407+M467+M527+M587+M647+M707+M767+M827+M887+M947+M1007+M1067+M1127+M1187+M1247","v":143626},{"$f":"N47+N107+N167+N227+N287+N347+N407+N467+N527+N587+N647+N707+N767+N827+N887+N947+N1007+N1067+N1127+N1187+N1247","v":853369},{"$f":"IF(P1340=\"x2\",M1340,O1339)","v":97689},{"$f":"IF(M1340>O1339*2,\"x2\",O1339)","v":97689},{"$f":"IF(P1340=\"x2\",M1340,\"\")","v":""},null,null,{"$f":"IF(J1340-J1339=0,\"\",J1340-J1339)","v":368},{"$f":"IF(K1340-K1339=0,\"\",K1340-K1339)","v":1979},{"$f":"IF(L1340-L1339=0,\"\",L1340-L1339)","v":610},{"$f":"IF(M1340-M1339=0,\"\",M1340-M1339)","v":4204},{"$f":"IF(N1340-N1339=0,\"\",N1340-N1339)","v":46244},{"$f":"IF(M1340=0,0,H1340/M1340)","v":0.67450879367245486},{"$f":"IF(M1340=0,0,K1340/M1340)","v":0.19822316293707268},{"$f":"IF(M1340=0,0,L1340/M1340)","v":0.12726804339047249},{"$f":"L1340*100/B$1285","v":645901.06007067137}]
[{"$f":"A1248","v":"2020-04-10T17:00:00"},0,"Italia",{"$f":"D48+D108+D168+D228+D288+D348+D408+D468+D528+D588+D648+D708+D768+D828+D888+D948+D1008+D1068+D1128+D1188+D1248","v":28242},{"$f":"E48+E108+E168+E228+E288+E348+E408+E468+E528+E588+E648+E708+E768+E828+E888+E948+E1008+E1068+E1128+E1188+E1248","v":3497},{"$f":"F48+F108+F168+F228+F288+F348+F408+F468+F528+F588+F648+F708+F768+F828+F888+F948+F1008+F1068+F1128+F1188+F1248","v":31739},{"$f":"G48+G108+G168+G228+G288+G348+G408+G468+G528+G588+G648+G708+G768+G828+G888+G948+G1008+G1068+G1128+G1188+G1248","v":66534},{"$f":"H48+H108+H168+H228+H288+H348+H408+H468+H528+H588+H648+H708+H768+H828+H888+H948+H1008+H1068+H1128+H1188+H1248","v":98273},{"$f":"I48+I108+I168+I228+I288+I348+I408+I468+I528+I588+I648+I708+I768+I828+I888+I948+I1008+I1068+I1128+I1188+I1248","v":1396},{"$f":"J48+J108+J168+J228+J288+J348+J408+J468+J528+J588+J648+J708+J768+J828+J888+J948+J1008+J1068+J1128+J1188+J1248","v":3951},{"$f":"K48+K108+K168+K228+K288+K348+K408+K468+K528+K588+K648+K708+K768+K828+K888+K948+K1008+K1068+K1128+K1188+K1248","v":30455},{"$f":"L48+L108+L168+L228+L288+L348+L408+L468+L528+L588+L648+L708+L768+L828+L888+L948+L1008+L1068+L1128+L1188+L1248","v":18849},{"$f":"M48+M108+M168+M228+M288+M348+M408+M468+M528+M588+M648+M708+M768+M828+M888+M948+M1008+M1068+M1128+M1188+M1248","v":147577},{"$f":"N48+N108+N168+N228+N288+N348+N408+N468+N528+N588+N648+N708+N768+N828+N888+N948+N1008+N1068+N1128+N1188+N1248","v":906864},{"$f":"IF(P1341=\"x2\",M1341,O1340)","v":97689},{"$f":"IF(M1341>O1340*2,\"x2\",O1340)","v":97689},{"$f":"IF(P1341=\"x2\",M1341,\"\")","v":""},null,null,{"$f":"IF(J1341-J1340=0,\"\",J1341-J1340)","v":-253},{"$f":"IF(K1341-K1340=0,\"\",K1341-K1340)","v":1985},{"$f":"IF(L1341-L1340=0,\"\",L1341-L1340)","v":570},{"$f":"IF(M1341-M1340=0,\"\",M1341-M1340)","v":3951},{"$f":"IF(N1341-N1340=0,\"\",N1341-N1340)","v":53495},{"$f":"IF(M1341=0,0,H1341/M1341)","v":0.66590999952567131},{"$f":"IF(M1341=0,0,K1341/M1341)","v":0.20636684578220182},{"$f":"IF(M1341=0,0,L1341/M1341)","v":0.12772315469212683},{"$f":"L1341*100/B$1285","v":666042.40282685508}]
[{"$f":"A1249","v":"2020-04-11T17:00:00"},0,"Italia",{"$f":"D49+D109+D169+D229+D289+D349+D409+D469+D529+D589+D649+D709+D769+D829+D889+D949+D1009+D1069+D1129+D1189+D1249","v":28144},{"$f":"E49+E109+E169+E229+E289+E349+E409+E469+E529+E589+E649+E709+E769+E829+E889+E949+E1009+E1069+E1129+E1189+E1249","v":3381},{"$f":"F49+F109+F169+F229+F289+F349+F409+F469+F529+F589+F649+F709+F769+F829+F889+F949+F1009+F1069+F1129+F1189+F1249","v":31525},{"$f":"G49+G109+G169+G229+G289+G349+G409+G469+G529+G589+G649+G709+G769+G829+G889+G949+G1009+G1069+G1129+G1189+G1249","v":68744},{"$f":"H49+H109+H169+H229+H289+H349+H409+H469+H529+H589+H649+H709+H769+H829+H889+H949+H1009+H1069+H1129+H1189+H1249","v":100269},{"$f":"I49+I109+I169+I229+I289+I349+I409+I469+I529+I589+I649+I709+I769+I829+I889+I949+I1009+I1069+I1129+I1189+I1249","v":1996},{"$f":"J49+J109+J169+J229+J289+J349+J409+J469+J529+J589+J649+J709+J769+J829+J889+J949+J1009+J1069+J1129+J1189+J1249","v":4694},{"$f":"K49+K109+K169+K229+K289+K349+K409+K469+K529+K589+K649+K709+K769+K829+K889+K949+K1009+K1069+K1129+K1189+K1249","v":32534},{"$f":"L49+L109+L169+L229+L289+L349+L409+L469+L529+L589+L649+L709+L769+L829+L889+L949+L1009+L1069+L1129+L1189+L1249","v":19468},{"$f":"M49+M109+M169+M229+M289+M349+M409+M469+M529+M589+M649+M709+M769+M829+M889+M949+M1009+M1069+M1129+M1189+M1249","v":152271},{"$f":"N49+N109+N169+N229+N289+N349+N409+N469+N529+N589+N649+N709+N769+N829+N889+N949+N1009+N1069+N1129+N1189+N1249","v":963473},{"$f":"IF(P1342=\"x2\",M1342,O1341)","v":97689},{"$f":"IF(M1342>O1341*2,\"x2\",O1341)","v":97689},{"$f":"IF(P1342=\"x2\",M1342,\"\")","v":""},null,null,{"$f":"IF(J1342-J1341=0,\"\",J1342-J1341)","v":743},{"$f":"IF(K1342-K1341=0,\"\",K1342-K1341)","v":2079},{"$f":"IF(L1342-L1341=0,\"\",L1342-L1341)","v":619},{"$f":"IF(M1342-M1341=0,\"\",M1342-M1341)","v":4694},{"$f":"IF(N1342-N1341=0,\"\",N1342-N1341)","v":56609},{"$f":"IF(M1342=0,0,H1342/M1342)","v":0.65849045451858856},{"$f":"IF(M1342=0,0,K1342/M1342)","v":0.21365854299242798},{"$f":"IF(M1342=0,0,L1342/M1342)","v":0.12785100248898346},{"$f":"L1342*100/B$1285","v":687915.19434628973}]
[{"$f":"A1250","v":"2020-04-12T17:00:00"},0,"Italia",{"$f":"D50+D110+D170+D230+D290+D350+D410+D470+D530+D590+D650+D710+D770+D830+D890+D950+D1010+D1070+D1130+D1190+D1250","v":27847},{"$f":"E50+E110+E170+E230+E290+E350+E410+E470+E530+E590+E650+E710+E770+E830+E890+E950+E1010+E1070+E1130+E1190+E1250","v":3343},{"$f":"F50+F110+F170+F230+F290+F350+F410+F470+F530+F590+F650+F710+F770+F830+F890+F950+F1010+F1070+F1130+F1190+F1250","v":31190},{"$f":"G50+G110+G170+G230+G290+G350+G410+G470+G530+G590+G650+G710+G770+G830+G890+G950+G1010+G1070+G1130+G1190+G1250","v":71063},{"$f":"H50+H110+H170+H230+H290+H350+H410+H470+H530+H590+H650+H710+H770+H830+H890+H950+H1010+H1070+H1130+H1190+H1250","v":102253},{"$f":"I50+I110+I170+I230+I290+I350+I410+I470+I530+I590+I650+I710+I770+I830+I890+I950+I1010+I1070+I1130+I1190+I1250","v":1984},{"$f":"J50+J110+J170+J230+J290+J350+J410+J470+J530+J590+J650+J710+J770+J830+J890+J950+J1010+J1070+J1130+J1190+J1250","v":4092},{"$f":"K50+K110+K170+K230+K290+K350+K410+K470+K530+K590+K650+K710+K770+K830+K890+K950+K1010+K1070+K1130+K1190+K1250","v":34211},{"$f":"L50+L110+L170+L230+L290+L350+L410+L470+L530+L590+L650+L710+L770+L830+L890+L950+L1010+L1070+L1130+L1190+L1250","v":19899},{"$f":"M50+M110+M170+M230+M290+M350+M410+M470+M530+M590+M650+M710+M770+M830+M890+M950+M1010+M1070+M1130+M1190+M1250","v":156363},{"$f":"N50+N110+N170+N230+N290+N350+N410+N470+N530+N590+N650+N710+N770+N830+N890+N950+N1010+N1070+N1130+N1190+N1250","v":1010193},{"$f":"IF(P1343=\"x2\",M1343,O1342)","v":97689},{"$f":"IF(M1343>O1342*2,\"x2\",O1342)","v":97689},{"$f":"IF(P1343=\"x2\",M1343,\"\")","v":""},null,null,{"$f":"IF(J1343-J1342=0,\"\",J1343-J1342)","v":-602},{"$f":"IF(K1343-K1342=0,\"\",K1343-K1342)","v":1677},{"$f":"IF(L1343-L1342=0,\"\",L1343-L1342)","v":431},{"$f":"IF(M1343-M1342=0,\"\",M1343-M1342)","v":4092},{"$f":"IF(N1343-N1342=0,\"\",N1343-N1342)","v":46720},{"$f":"IF(M1343=0,0,H1343/M1343)","v":0.65394626606038508},{"$f":"IF(M1343=0,0,K1343/M1343)","v":0.21879216950301542},{"$f":"IF(M1343=0,0,L1343/M1343)","v":0.12726156443659944},{"$f":"L1343*100/B$1285","v":703144.87632508832}]
[{"$f":"A1251","v":"2020-04-13T17:00:00"},0,"Italia",{"$f":"D51+D111+D171+D231+D291+D351+D411+D471+D531+D591+D651+D711+D771+D831+D891+D951+D1011+D1071+D1131+D1191+D1251","v":28023},{"$f":"E51+E111+E171+E231+E291+E351+E411+E471+E531+E591+E651+E711+E771+E831+E891+E951+E1011+E1071+E1131+E1191+E1251","v":3260},{"$f":"F51+F111+F171+F231+F291+F351+F411+F471+F531+F591+F651+F711+F771+F831+F891+F951+F1011+F1071+F1131+F1191+F1251","v":31283},{"$f":"G51+G111+G171+G231+G291+G351+G411+G471+G531+G591+G651+G711+G771+G831+G891+G951+G1011+G1071+G1131+G1191+G1251","v":72333},{"$f":"H51+H111+H171+H231+H291+H351+H411+H471+H531+H591+H651+H711+H771+H831+H891+H951+H1011+H1071+H1131+H1191+H1251","v":103616},{"$f":"I51+I111+I171+I231+I291+I351+I411+I471+I531+I591+I651+I711+I771+I831+I891+I951+I1011+I1071+I1131+I1191+I1251","v":1363},{"$f":"J51+J111+J171+J231+J291+J351+J411+J471+J531+J591+J651+J711+J771+J831+J891+J951+J1011+J1071+J1131+J1191+J1251","v":3153},{"$f":"K51+K111+K171+K231+K291+K351+K411+K471+K531+K591+K651+K711+K771+K831+K891+K951+K1011+K1071+K1131+K1191+K1251","v":35435},{"$f":"L51+L111+L171+L231+L291+L351+L411+L471+L531+L591+L651+L711+L771+L831+L891+L951+L1011+L1071+L1131+L1191+L1251","v":20465},{"$f":"M51+M111+M171+M231+M291+M351+M411+M471+M531+M591+M651+M711+M771+M831+M891+M951+M1011+M1071+M1131+M1191+M1251","v":159516},{"$f":"N51+N111+N171+N231+N291+N351+N411+N471+N531+N591+N651+N711+N771+N831+N891+N951+N1011+N1071+N1131+N1191+N1251","v":1046910},{"$f":"IF(P1344=\"x2\",M1344,O1343)","v":97689},{"$f":"IF(M1344>O1343*2,\"x2\",O1343)","v":97689},{"$f":"IF(P1344=\"x2\",M1344,\"\")","v":""},null,null,{"$f":"IF(J1344-J1343=0,\"\",J1344-J1343)","v":-939},{"$f":"IF(K1344-K1343=0,\"\",K1344-K1343)","v":1224},{"$f":"IF(L1344-L1343=0,\"\",L1344-L1343)","v":566},{"$f":"IF(M1344-M1343=0,\"\",M1344-M1343)","v":3153},{"$f":"IF(N1344-N1343=0,\"\",N1344-N1343)","v":36717},{"$f":"IF(M1344=0,0,H1344/M1344)","v":0.64956493392512349},{"$f":"IF(M1344=0,0,K1344/M1344)","v":0.22214072569522805},{"$f":"IF(M1344=0,0,L1344/M1344)","v":0.12829434037964843},{"$f":"L1344*100/B$1285","v":723144.87632508832}]
[{"$f":"A1252","v":"2020-04-14T17:00:00"},0,"Italia",{"$f":"D52+D112+D172+D232+D292+D352+D412+D472+D532+D592+D652+D712+D772+D832+D892+D952+D1012+D1072+D1132+D1192+D1252","v":28011},{"$f":"E52+E112+E172+E232+E292+E352+E412+E472+E532+E592+E652+E712+E772+E832+E892+E952+E1012+E1072+E1132+E1192+E1252","v":3186},{"$f":"F52+F112+F172+F232+F292+F352+F412+F472+F532+F592+F652+F712+F772+F832+F892+F952+F1012+F1072+F1132+F1192+F1252","v":31197},{"$f":"G52+G112+G172+G232+G292+G352+G412+G472+G532+G592+G652+G712+G772+G832+G892+G952+G1012+G1072+G1132+G1192+G1252","v":73094},{"$f":"H52+H112+H172+H232+H292+H352+H412+H472+H532+H592+H652+H712+H772+H832+H892+H952+H1012+H1072+H1132+H1192+H1252","v":104291},{"$f":"I52+I112+I172+I232+I292+I352+I412+I472+I532+I592+I652+I712+I772+I832+I892+I952+I1012+I1072+I1132+I1192+I1252","v":675},{"$f":"J52+J112+J172+J232+J292+J352+J412+J472+J532+J592+J652+J712+J772+J832+J892+J952+J1012+J1072+J1132+J1192+J1252","v":2972},{"$f":"K52+K112+K172+K232+K292+K352+K412+K472+K532+K592+K652+K712+K772+K832+K892+K952+K1012+K1072+K1132+K1192+K1252","v":37130},{"$f":"L52+L112+L172+L232+L292+L352+L412+L472+L532+L592+L652+L712+L772+L832+L892+L952+L1012+L1072+L1132+L1192+L1252","v":21067},{"$f":"M52+M112+M172+M232+M292+M352+M412+M472+M532+M592+M652+M712+M772+M832+M892+M952+M1012+M1072+M1132+M1192+M1252","v":162488},{"$f":"N52+N112+N172+N232+N292+N352+N412+N472+N532+N592+N652+N712+N772+N832+N892+N952+N1012+N1072+N1132+N1192+N1252","v":1073689},{"$f":"IF(P1345=\"x2\",M1345,O1344)","v":97689},{"$f":"IF(M1345>O1344*2,\"x2\",O1344)","v":97689},{"$f":"IF(P1345=\"x2\",M1345,\"\")","v":""},null,null,{"$f":"IF(J1345-J1344=0,\"\",J1345-J1344)","v":-181},{"$f":"IF(K1345-K1344=0,\"\",K1345-K1344)","v":1695},{"$f":"IF(L1345-L1344=0,\"\",L1345-L1344)","v":602},{"$f":"IF(M1345-M1344=0,\"\",M1345-M1344)","v":2972},{"$f":"IF(N1345-N1344=0,\"\",N1345-N1344)","v":26779},{"$f":"IF(M1345=0,0,H1345/M1345)","v":0.64183816651075776},{"$f":"IF(M1345=0,0,K1345/M1345)","v":0.22850918221653291},{"$f":"IF(M1345=0,0,L1345/M1345)","v":0.12965265127270936},{"$f":"L1345*100/B$1285","v":744416.96113074198}]
[{"$f":"A1253","v":"2020-04-15T17:00:00"},0,"Italia",{"$f":"D53+D113+D173+D233+D293+D353+D413+D473+D533+D593+D653+D713+D773+D833+D893+D953+D1013+D1073+D1133+D1193+D1253","v":27643},{"$f":"E53+E113+E173+E233+E293+E353+E413+E473+E533+E593+E653+E713+E773+E833+E893+E953+E1013+E1073+E1133+E1193+E1253","v":3079},{"$f":"F53+F113+F173+F233+F293+F353+F413+F473+F533+F593+F653+F713+F773+F833+F893+F953+F1013+F1073+F1133+F1193+F1253","v":30722},{"$f":"G53+G113+G173+G233+G293+G353+G413+G473+G533+G593+G653+G713+G773+G833+G893+G953+G1013+G1073+G1133+G1193+G1253","v":74696},{"$f":"H53+H113+H173+H233+H293+H353+H413+H473+H533+H593+H653+H713+H773+H833+H893+H953+H1013+H1073+H1133+H1193+H1253","v":105418},{"$f":"I53+I113+I173+I233+I293+I353+I413+I473+I533+I593+I653+I713+I773+I833+I893+I953+I1013+I1073+I1133+I1193+I1253","v":1127},{"$f":"J53+J113+J173+J233+J293+J353+J413+J473+J533+J593+J653+J713+J773+J833+J893+J953+J1013+J1073+J1133+J1193+J1253","v":2667},{"$f":"K53+K113+K173+K233+K293+K353+K413+K473+K533+K593+K653+K713+K773+K833+K893+K953+K1013+K1073+K1133+K1193+K1253","v":38092},{"$f":"L53+L113+L173+L233+L293+L353+L413+L473+L533+L593+L653+L713+L773+L833+L893+L953+L1013+L1073+L1133+L1193+L1253","v":21645},{"$f":"M53+M113+M173+M233+M293+M353+M413+M473+M533+M593+M653+M713+M773+M833+M893+M953+M1013+M1073+M1133+M1193+M1253","v":165155},{"$f":"N53+N113+N173+N233+N293+N353+N413+N473+N533+N593+N653+N713+N773+N833+N893+N953+N1013+N1073+N1133+N1193+N1253","v":1117404},{"$f":"IF(P1346=\"x2\",M1346,O1345)","v":97689},{"$f":"IF(M1346>O1345*2,\"x2\",O1345)","v":97689},{"$f":"IF(P1346=\"x2\",M1346,\"\")","v":""},null,null,{"$f":"IF(J1346-J1345=0,\"\",J1346-J1345)","v":-305},{"$f":"IF(K1346-K1345=0,\"\",K1346-K1345)","v":962},{"$f":"IF(L1346-L1345=0,\"\",L1346-L1345)","v":578},{"$f":"IF(M1346-M1345=0,\"\",M1346-M1345)","v":2667},{"$f":"IF(N1346-N1345=0,\"\",N1346-N1345)","v":43715},{"$f":"IF(M1346=0,0,H1346/M1346)","v":0.63829735702824619},{"$f":"IF(M1346=0,0,K1346/M1346)","v":0.2306439405407042},{"$f":"IF(M1346=0,0,L1346/M1346)","v":0.13105870243104961},{"$f":"L1346*100/B$1285","v":764840.98939929332}]
[{"$f":"A1346+1","v":"2020-04-16T17:00:00"},null,null,null,null,null,null,null,null,null,null,null,null,null,null,"Media x2",{"$f":"COUNT(M1295:M1346) / COUNT(Q1295:Q1346)","v":6.5}]
[{"$f":"A1347+1","v":"2020-04-17T17:00:00"}]
[{"$f":"A1348+1","v":"2020-04-18T17:00:00"}]
[null,null,null,null,{"$f":"E1346/$M1346","v":1.8643092852169175E-2},null,null,{"$f":"H1346/$M1346","v":0.63829735702824619},null,null,{"$f":"K1346/$M1346","v":0.2306439405407042},{"$f":"L1346/$M1346","v":0.13105870243104961},null,{"$f":"N1346/$M1346","v":6.7657897126941355}]

{"sheet":"Dati","index":2,"n_rows":22,"n_cols":14,"rows_kept":22,"cut":false,"hidden":false,"merged":[]}
["data","codice_regione","denominazione_regione","ricoverati_con_sintomi","terapia_intensiva","totale_ospedalizzati","isolamento_domiciliare","totale_positivi","variazione_totale_positivi","nuovi_positivi","dimessi_guariti","deceduti","totale_casi","tamponi"]
["2020-04-15T17:00:00",1,"Piemonte",3338,366,3704,9491,13195,140,539,3019,2015,18229,75664]
["2020-04-15T17:00:00",2,"Valle d'Aosta",112,11,123,425,548,-11,11,289,121,958,3894]
["2020-04-15T17:00:00",3,"Lombardia",12043,1074,13117,19804,32921,558,827,17855,11377,62153,221968]
["2020-04-15T17:00:00",4,"P.A. Bolzano",166,32,198,1378,1576,12,40,425,223,2224,25370]
["2020-04-15T17:00:00",4,"P.A. Trento",312,48,360,1744,2104,22,79,798,318,3220,19535]
["2020-04-15T17:00:00",5,"Veneto",1402,219,1621,9168,10789,53,192,2895,940,14624,216344]
["2020-04-15T17:00:00",6,"Friuli Venezia Giulia",163,24,187,1207,1394,495,24,938,212,2544,33800]
["2020-04-15T17:00:00",7,"Liguria",959,120,1079,2385,3464,-2,128,1665,807,5936,25793]
["2020-04-15T17:00:00",8,"Emilia-Romagna",3388,325,3713,9864,13577,-201,277,4664,2788,21029,106149]
["2020-04-15T17:00:00",9,"Toscana",977,216,1193,5224,6417,65,139,693,556,7666,86348]
["2020-04-15T17:00:00",10,"Umbria",122,37,159,423,582,-40,1,686,54,1322,20258]
["2020-04-15T17:00:00",11,"Marche",888,106,994,2103,3097,2,77,1660,746,5503,30329]
["2020-04-15T17:00:00",12,"Lazio",1342,196,1538,2509,4047,25,121,874,311,5232,75584]
["2020-04-15T17:00:00",13,"Abruzzo",341,44,385,1425,1810,10,29,224,240,2274,22500]
["2020-04-15T17:00:00",14,"Molise",27,4,31,175,206,6,6,42,15,263,2855]
["2020-04-15T17:00:00",15,"Campania",607,86,693,2394,3087,-7,38,442,278,3807,39534]
["2020-04-15T17:00:00",16,"Puglia",592,73,665,1908,2573,21,66,323,288,3184,34518]
["2020-04-15T17:00:00",17,"Basilicata",60,12,72,189,261,-4,1,38,21,320,5037]
["2020-04-15T17:00:00",18,"Calabria",156,11,167,652,819,3,15,81,71,971,19662]
["2020-04-15T17:00:00",19,"Sicilia",541,49,590,1491,2081,10,34,273,181,2535,39867]
["2020-04-15T17:00:00",20,"Sardegna",107,26,133,737,870,-30,23,208,83,1161,12395]